{"text_format":"1","workbook":"xlsx","n_sheets":4,"sheets":["申請者リスト","様式２","様式３","様式６"],"not_rendered":{"charts":0,"images":0,"macros":1,"external_links":0,"defined_names":4,"comments":0,"pivot_tables":0},"unopened":[],"bounds":{"document_bytes":16777216,"sheet_cells":100000,"rows_first":2000,"rows_last":500,"rows_between":2000,"halvings":0,"cell_chars":16384,"cell_head_chars":4096},"cells_cut":0,"cells_raw":0,"read":"whole","date_system":"1900"}

{"sheet":"申請者リスト","index":0,"n_rows":2004,"n_cols":21,"rows_kept":2004,"cut":false,"hidden":false,"merged":[]}
["「埼玉県高校生専門資格等取得表彰申請書」提出者リスト（Ver.5.1）"]
[]
["Ｎｏ","学校コード","整理番号","学校名","ふりがな","生徒氏名","学科","学年","生年月日","NO.","種目","資格・検定試験等の名称","級・合格等","主催団体等","取得年月日","ランク","得点"]
[1,null,null,null,null,null,null,null,null,null,null,null,null,null,null,null,null,null,null,null,"男"]
[2,null,null,null,null,null,null,null,null,null,null,null,null,null,null,null,null,null,null,null,"女"]
[3]
[4]
[5]
[6]
[7]
[8]
[9]
[10]
[11]
[12]
[13]
[14]
[15]
[16]
[17]
{"$rows_left_out":1985}
{"sheet":"様式２","index":1,"n_rows":22,"n_cols":6,"rows_kept":22,"cut":false,"hidden":false,"merged":[[10,0,12,5],[14,0,14,5],[2,4,2,5],[3,0,3,1],[4,4,4,5],[5,4,5,5],[6,4,6,5],[8,0,8,5]]}
["（様式２）"]
[null,null,null,null,"第","第　　　　　　　号"]
[null,null,null,null,"令和　　年　　月　　日"]
["埼　玉　県　知　事"]
[null,null,null,"学 校 名","学校"]
[null,null,null,"学校長名","　　　　　　　"]
[null,null,null,"記入者名","　　"]
[]
["埼玉県高校生専門資格等取得表彰の推薦について（申請）"]
[]
["　標記の件について、埼玉県高校生専門資格等取得表彰制度実施要項第８条の規定により別添のとおり推薦します。\n  なお、集計の結果は下記のとおりです。　　"]
[]
[]
[]
["記"]
[]
[null,"１　　　年","２　　　年","３　　　年","４　　　年","合　　　計"]
["計",{"$f":"COUNTIF(様式３!$B$10:$B$24,\"1\")+COUNTIF(様式３!$B$40:$B$54,\"1\")+\nCOUNTIF(様式３!$B$70:$B$84,\"1\")+COUNTIF(様式３!$B$100:$B$114,\"1\")+\nCOUNTIF(様式３!$B$130:$B$144,\"1\")+COUNTIF(様式３!$B$160:$B$174,\"1\")+\nCOUNTIF(様式３!$B$190:$B$204,\"1\")+COUNTIF(様式３!$B$220:$B$234,\"1\")+\nCOUNTIF(様式３!$B$250:$B$264,\"1\")+COUNTIF(様式３!$B$280:$B$294,\"1\")+\nCOUNTIF(様式３!$B$310:$B$324,\"1\")+COUNTIF(様式３!$B$340:$B$354,\"1\")+\nCOUNTIF(様式３!$B$370:$B$384,\"1\")+COUNTIF(様式３!$B$400:$B$414,\"1\")+\nCOUNTIF(様式３!$B$430:$B$444,\"1\")+COUNTIF(様式３!$B$460:$B$474,\"1\")","v":0},{"$f":"COUNTIF(様式３!$B$10:$B$24,\"2\")+COUNTIF(様式３!$B$40:$B$54,\"2\")+\nCOUNTIF(様式３!$B$70:$B$84,\"2\")+COUNTIF(様式３!$B$100:$B$114,\"2\")+\nCOUNTIF(様式３!$B$130:$B$144,\"2\")+COUNTIF(様式３!$B$160:$B$174,\"2\")+\nCOUNTIF(様式３!$B$190:$B$204,\"2\")+COUNTIF(様式３!$B$220:$B$234,\"2\")+\nCOUNTIF(様式３!$B$250:$B$264,\"2\")+COUNTIF(様式３!$B$280:$B$294,\"2\")+\nCOUNTIF(様式３!$B$310:$B$324,\"2\")+COUNTIF(様式３!$B$340:$B$354,\"2\")+\nCOUNTIF(様式３!$B$370:$B$384,\"2\")+COUNTIF(様式３!$B$400:$B$414,\"2\")+\nCOUNTIF(様式３!$B$430:$B$444,\"2\")+COUNTIF(様式３!$B$460:$B$474,\"2\")","v":0},{"$f":"COUNTIF(様式３!$B$10:$B$24,\"3\")+COUNTIF(様式３!$B$40:$B$54,\"3\")+\nCOUNTIF(様式３!$B$70:$B$84,\"3\")+COUNTIF(様式３!$B$100:$B$114,\"3\")+\nCOUNTIF(様式３!$B$130:$B$144,\"3\")+COUNTIF(様式３!$B$160:$B$174,\"3\")+\nCOUNTIF(様式３!$B$190:$B$204,\"3\")+COUNTIF(様式３!$B$220:$B$234,\"3\")+\nCOUNTIF(様式３!$B$250:$B$264,\"3\")+COUNTIF(様式３!$B$280:$B$294,\"3\")+\nCOUNTIF(様式３!$B$310:$B$324,\"3\")+COUNTIF(様式３!$B$340:$B$354,\"3\")+\nCOUNTIF(様式３!$B$370:$B$384,\"3\")+COUNTIF(様式３!$B$400:$B$414,\"3\")+\nCOUNTIF(様式３!$B$430:$B$444,\"3\")+COUNTIF(様式３!$B$460:$B$474,\"3\")","v":0},{"$f":"COUNTIF(様式３!$B$10:$B$24,\"4\")+COUNTIF(様式３!$B$40:$B$54,\"4\")+\nCOUNTIF(様式３!$B$70:$B$84,\"4\")+COUNTIF(様式３!$B$100:$B$114,\"4\")+\nCOUNTIF(様式３!$B$130:$B$144,\"4\")+COUNTIF(様式３!$B$160:$B$174,\"4\")+\nCOUNTIF(様式３!$B$190:$B$204,\"4\")+COUNTIF(様式３!$B$220:$B$234,\"4\")+\nCOUNTIF(様式３!$B$250:$B$264,\"4\")+COUNTIF(様式３!$B$280:$B$294,\"4\")+\nCOUNTIF(様式３!$B$310:$B$324,\"4\")+COUNTIF(様式３!$B$340:$B$354,\"4\")+\nCOUNTIF(様式３!$B$370:$B$384,\"4\")+COUNTIF(様式３!$B$400:$B$414,\"4\")+\nCOUNTIF(様式３!$B$430:$B$444,\"4\")+COUNTIF(様式３!$B$460:$B$474,\"4\")","v":0},{"$f":"SUM(B18:E18)","v":0}]
["Ａ　ランク",{"$f":"COUNTIFS(申請者リスト!$H$4:$H$2003,1,申請者リスト!$P$4:$P$2003,\"A\")","v":0},{"$f":"COUNTIFS(申請者リスト!$H$4:$H$2003,2,申請者リスト!$P$4:$P$2003,\"A\")","v":0},{"$f":"COUNTIFS(申請者リスト!$H$4:$H$2003,3,申請者リスト!$P$4:$P$2003,\"A\")","v":0},{"$f":"COUNTIFS(申請者リスト!$H$4:$H$2003,,申請者リスト!$P$4:$P$2003,\"A\")","v":0},{"$f":"SUM(B19:E19)","v":0}]
["Ｂ　ランク",{"$f":"COUNTIFS(申請者リスト!$H$4:$H$2003,1,申請者リスト!$P$4:$P$2003,\"B\")","v":0},{"$f":"COUNTIFS(申請者リスト!$H$4:$H$2003,2,申請者リスト!$P$4:$P$2003,\"B\")","v":0},{"$f":"COUNTIFS(申請者リスト!$H$4:$H$2003,3,申請者リスト!$P$4:$P$2003,\"B\")","v":0},{"$f":"COUNTIFS(申請者リスト!$H$4:$H$2003,,申請者リスト!$P$4:$P$2003,\"B\")","v":0},{"$f":"SUM(B20:E20)","v":0}]
{"$rows_left_out":3}
{"sheet":"様式３","index":2,"n_rows":479,"n_cols":16,"rows_kept":479,"cut":false,"hidden":false,"merged":[[2,0,2,14],[4,9,4,13],[6,0,8,0],[6,1,8,1],[6,2,8,2],[6,3,8,3],[6,4,8,8],[6,9,6,12],[6,13,8,13],[6,14,8,14],[32,0,32,14],[34,9,34,13],[36,0,38,0],[36,1,38,1],[36,2,38,2],[36,3,38,3],[36,4,38,8],[36,9,36,12],[36,13,38,13],[36,14,38,14],[62,0,62,14],[64,9,64,13],[66,0,68,0],[66,1,68,1],[66,2,68,2],[66,3,68,3],[66,4,68,8],[66,9,66,12],[66,13,68,13],[66,14,68,14],[92,0,92,14],[94,9,94,13],[96,0,98,0],[96,1,98,1],[96,2,98,2],[96,3,98,3],[96,4,98,8],[96,9,96,12],[96,13,98,13],[96,14,98,14],[122,0,122,14],[124,9,124,13],[126,0,128,0],[126,1,128,1],[126,2,128,2],[126,3,128,3],[126,4,128,8],[126,9,126,12],[126,13,128,13],[126,14,128,14],[152,0,152,14],[154,9,154,13],[156,0,158,0],[156,1,158,1],[156,2,158,2],[156,3,158,3],[156,4,158,8],[156,9,156,12],[156,13,158,13],[156,14,158,14],[182,0,182,14],[184,9,184,13],[186,0,188,0],[186,1,188,1],[186,2,188,2],[186,3,188,3],[186,4,188,8],[186,9,186,12],[186,13,188,13],[186,14,188,14],[212,0,212,14],[214,9,214,13],[216,0,218,0],[216,1,218,1],[216,2,218,2],[216,3,218,3],[216,4,218,8],[216,9,216,12],[216,13,218,13],[216,14,218,14],[242,0,242,14],[244,9,244,13],[246,0,248,0],[246,1,248,1],[246,2,248,2],[246,3,248,3],[246,4,248,8],[246,9,246,12],[246,13,248,13],[246,14,248,14],[272,0,272,14],[274,9,274,13],[276,0,278,0],[276,1,278,1],[276,2,278,2],[276,3,278,3],[276,4,278,8],[276,9,276,12],[276,13,278,13],[276,14,278,14],[302,0,302,14],[304,9,304,13],[306,0,308,0],[306,1,308,1],[306,2,308,2],[306,3,308,3],[306,4,308,8],[306,9,306,12],[306,13,308,13],[306,14,308,14],[332,0,332,14],[334,9,334,13],[336,0,338,0],[336,1,338,1],[336,2,338,2],[336,3,338,3],[336,4,338,8],[336,9,336,12],[336,13,338,13],[336,14,338,14],[362,0,362,14],[364,9,364,13],[366,0,368,0],[366,1,368,1],[366,2,368,2],[366,3,368,3],[366,4,368,8],[366,9,366,12],[366,13,368,13],[366,14,368,14],[392,0,392,14],[394,9,394,13],[396,0,398,0],[396,1,398,1],[396,2,398,2],[396,3,398,3],[396,4,398,8],[396,9,396,12],[396,13,398,13],[396,14,398,14],[422,0,422,14],[424,9,424,13],[426,0,428,0],[426,1,428,1],[426,2,428,2],[426,3,428,3],[426,4,428,8],[426,9,426,12],[426,13,428,13],[426,14,428,14],[452,0,452,14],[454,9,454,13],[456,0,458,0],[456,1,458,1],[456,2,458,2],[456,3,458,3],[456,4,458,8],[456,9,456,12],[456,13,458,13],[456,14,458,14]]}
["（様式３）",null,null,null,null,null,null,null,null,null,"(",null,"枚中",1,"枚目）","このシートの保護は解除したままにしてください。"]
[]
["埼玉県高校生専門資格等取得表彰推薦名簿"]
[]
[null,null,null,null,null,null,"学  校  名　　　　　　　　　　",null,null,null,null,null,null,null,"学校"]
[]
["Ｎｏ","学　年　　　　　　　　　　　　　　　　　　　","学　科","整理番号","生　年　月　日",null,null,null,null,"資格・試験等ﾗﾝｸ",null,null,null,"得点合計","備　考"]
[null,null,null,null,null,null,null,null,null,"A","B","C","D"]
[null,null,null,null,null,null,null,null,null,6,3,2,1]
[1,null,null,null,{"$f":"IFERROR(YEAR(VLOOKUP($D10,申請者リスト!$C$4:$Q$2003,7,FALSE)),\"\")","v":""},"・",{"$f":"IFERROR(MONTH(VLOOKUP($D10,申請者リスト!$C$4:$Q$2003,7,FALSE)),\"\")","v":""},"・",{"$f":"IFERROR(DAY(VLOOKUP($D10,申請者リスト!$C$4:$Q$2003,7,FALSE)),\"\")","v":""},{"$f":"COUNTIFS(申請者リスト!$C$4:$C$2003,様式３!$D10,申請者リスト!$P$4:$P$2003,J$8)","v":0},{"$f":"COUNTIFS(申請者リスト!$C$4:$C$2003,様式３!$D10,申請者リスト!$P$4:$P$2003,K$8)","v":0},{"$f":"COUNTIFS(申請者リスト!$C$4:$C$2003,様式３!$D10,申請者リスト!$P$4:$P$2003,L$8)","v":0},{"$f":"COUNTIFS(申請者リスト!$C$4:$C$2003,様式３!$D10,申請者リスト!$P$4:$P$2003,M$8)","v":0},{"$f":"J10*$J$9+K10*$K$9+L10*$L$9+M10*$M$9","v":0}]
[{"$f":"+A10+1","v":2},null,null,null,{"$f":"IFERROR(YEAR(VLOOKUP($D11,申請者リスト!$C$4:$Q$2003,7,FALSE)),\"\")","v":""},"・",{"$f":"IFERROR(MONTH(VLOOKUP($D11,申請者リスト!$C$4:$Q$2003,7,FALSE)),\"\")","v":""},"・",{"$f":"IFERROR(DAY(VLOOKUP($D11,申請者リスト!$C$4:$Q$2003,7,FALSE)),\"\")","v":""},{"$f":"COUNTIFS(申請者リスト!$C$4:$C$2003,様式３!$D11,申請者リスト!$P$4:$P$2003,J$8)","v":0},{"$f":"COUNTIFS(申請者リスト!$C$4:$C$2003,様式３!$D11,申請者リスト!$P$4:$P$2003,K$8)","v":0},{"$f":"COUNTIFS(申請者リスト!$C$4:$C$2003,様式３!$D11,申請者リスト!$P$4:$P$2003,L$8)","v":0},{"$f":"COUNTIFS(申請者リスト!$C$4:$C$2003,様式３!$D11,申請者リスト!$P$4:$P$2003,M$8)","v":0},{"$f":"J11*$J$9+K11*$K$9+L11*$L$9+M11*$M$9","v":0}]
[{"$f":"+A11+1","v":3},null,null,null,{"$f":"IFERROR(YEAR(VLOOKUP($D12,申請者リスト!$C$4:$Q$2003,7,FALSE)),\"\")","v":""},"・",{"$f":"IFERROR(MONTH(VLOOKUP($D12,申請者リスト!$C$4:$Q$2003,7,FALSE)),\"\")","v":""},"・",{"$f":"IFERROR(DAY(VLOOKUP($D12,申請者リスト!$C$4:$Q$2003,7,FALSE)),\"\")","v":""},{"$f":"COUNTIFS(申請者リスト!$C$4:$C$2003,様式３!$D12,申請者リスト!$P$4:$P$2003,J$8)","v":0},{"$f":"COUNTIFS(申請者リスト!$C$4:$C$2003,様式３!$D12,申請者リスト!$P$4:$P$2003,K$8)","v":0},{"$f":"COUNTIFS(申請者リスト!$C$4:$C$2003,様式３!$D12,申請者リスト!$P$4:$P$2003,L$8)","v":0},{"$f":"COUNTIFS(申請者リスト!$C$4:$C$2003,様式３!$D12,申請者リスト!$P$4:$P$2003,M$8)","v":0},0]
[4,null,null,null,{"$f":"IFERROR(YEAR(VLOOKUP($D13,申請者リスト!$C$4:$Q$2003,7,FALSE)),\"\")","v":""},"・",{"$f":"IFERROR(MONTH(VLOOKUP($D13,申請者リスト!$C$4:$Q$2003,7,FALSE)),\"\")","v":""},"・",{"$f":"IFERROR(DAY(VLOOKUP($D13,申請者リスト!$C$4:$Q$2003,7,FALSE)),\"\")","v":""},{"$f":"COUNTIFS(申請者リスト!$C$4:$C$2003,様式３!$D13,申請者リスト!$P$4:$P$2003,J$8)","v":0},{"$f":"COUNTIFS(申請者リスト!$C$4:$C$2003,様式３!$D13,申請者リスト!$P$4:$P$2003,K$8)","v":0},{"$f":"COUNTIFS(申請者リスト!$C$4:$C$2003,様式３!$D13,申請者リスト!$P$4:$P$2003,L$8)","v":0},{"$f":"COUNTIFS(申請者リスト!$C$4:$C$2003,様式３!$D13,申請者リスト!$P$4:$P$2003,M$8)","v":0},0]
[5,null,null,null,{"$f":"IFERROR(YEAR(VLOOKUP($D14,申請者リスト!$C$4:$Q$2003,7,FALSE)),\"\")","v":""},"・",{"$f":"IFERROR(MONTH(VLOOKUP($D14,申請者リスト!$C$4:$Q$2003,7,FALSE)),\"\")","v":""},"・",{"$f":"IFERROR(DAY(VLOOKUP($D14,申請者リスト!$C$4:$Q$2003,7,FALSE)),\"\")","v":""},{"$f":"COUNTIFS(申請者リスト!$C$4:$C$2003,様式３!$D14,申請者リスト!$P$4:$P$2003,J$8)","v":0},{"$f":"COUNTIFS(申請者リスト!$C$4:$C$2003,様式３!$D14,申請者リスト!$P$4:$P$2003,K$8)","v":0},{"$f":"COUNTIFS(申請者リスト!$C$4:$C$2003,様式３!$D14,申請者リスト!$P$4:$P$2003,L$8)","v":0},{"$f":"COUNTIFS(申請者リスト!$C$4:$C$2003,様式３!$D14,申請者リスト!$P$4:$P$2003,M$8)","v":0},0]
[6,null,null,null,{"$f":"IFERROR(YEAR(VLOOKUP($D15,申請者リスト!$C$4:$Q$2003,7,FALSE)),\"\")","v":""},"・",{"$f":"IFERROR(MONTH(VLOOKUP($D15,申請者リスト!$C$4:$Q$2003,7,FALSE)),\"\")","v":""},"・",{"$f":"IFERROR(DAY(VLOOKUP($D15,申請者リスト!$C$4:$Q$2003,7,FALSE)),\"\")","v":""},{"$f":"COUNTIFS(申請者リスト!$C$4:$C$2003,様式３!$D15,申請者リスト!$P$4:$P$2003,J$8)","v":0},{"$f":"COUNTIFS(申請者リスト!$C$4:$C$2003,様式３!$D15,申請者リスト!$P$4:$P$2003,K$8)","v":0},{"$f":"COUNTIFS(申請者リスト!$C$4:$C$2003,様式３!$D15,申請者リスト!$P$4:$P$2003,L$8)","v":0},{"$f":"COUNTIFS(申請者リスト!$C$4:$C$2003,様式３!$D15,申請者リスト!$P$4:$P$2003,M$8)","v":0},0]
[7,null,null,null,{"$f":"IFERROR(YEAR(VLOOKUP($D16,申請者リスト!$C$4:$Q$2003,7,FALSE)),\"\")","v":""},"・",{"$f":"IFERROR(MONTH(VLOOKUP($D16,申請者リスト!$C$4:$Q$2003,7,FALSE)),\"\")","v":""},"・",{"$f":"IFERROR(DAY(VLOOKUP($D16,申請者リスト!$C$4:$Q$2003,7,FALSE)),\"\")","v":""},{"$f":"COUNTIFS(申請者リスト!$C$4:$C$2003,様式３!$D16,申請者リスト!$P$4:$P$2003,J$8)","v":0},{"$f":"COUNTIFS(申請者リスト!$C$4:$C$2003,様式３!$D16,申請者リスト!$P$4:$P$2003,K$8)","v":0},{"$f":"COUNTIFS(申請者リスト!$C$4:$C$2003,様式３!$D16,申請者リスト!$P$4:$P$2003,L$8)","v":0},{"$f":"COUNTIFS(申請者リスト!$C$4:$C$2003,様式３!$D16,申請者リスト!$P$4:$P$2003,M$8)","v":0},0]
[8,null,null,null,{"$f":"IFERROR(YEAR(VLOOKUP($D17,申請者リスト!$C$4:$Q$2003,7,FALSE)),\"\")","v":""},"・",{"$f":"IFERROR(MONTH(VLOOKUP($D17,申請者リスト!$C$4:$Q$2003,7,FALSE)),\"\")","v":""},"・",{"$f":"IFERROR(DAY(VLOOKUP($D17,申請者リスト!$C$4:$Q$2003,7,FALSE)),\"\")","v":""},{"$f":"COUNTIFS(申請者リスト!$C$4:$C$2003,様式３!$D17,申請者リスト!$P$4:$P$2003,J$8)","v":0},{"$f":"COUNTIFS(申請者リスト!$C$4:$C$2003,様式３!$D17,申請者リスト!$P$4:$P$2003,K$8)","v":0},{"$f":"COUNTIFS(申請者リスト!$C$4:$C$2003,様式３!$D17,申請者リスト!$P$4:$P$2003,L$8)","v":0},{"$f":"COUNTIFS(申請者リスト!$C$4:$C$2003,様式３!$D17,申請者リスト!$P$4:$P$2003,M$8)","v":0},0]
[9,null,null,null,{"$f":"IFERROR(YEAR(VLOOKUP($D18,申請者リスト!$C$4:$Q$2003,7,FALSE)),\"\")","v":""},"・",{"$f":"IFERROR(MONTH(VLOOKUP($D18,申請者リスト!$C$4:$Q$2003,7,FALSE)),\"\")","v":""},"・",{"$f":"IFERROR(DAY(VLOOKUP($D18,申請者リスト!$C$4:$Q$2003,7,FALSE)),\"\")","v":""},{"$f":"COUNTIFS(申請者リスト!$C$4:$C$2003,様式３!$D18,申請者リスト!$P$4:$P$2003,J$8)","v":0},{"$f":"COUNTIFS(申請者リスト!$C$4:$C$2003,様式３!$D18,申請者リスト!$P$4:$P$2003,K$8)","v":0},{"$f":"COUNTIFS(申請者リスト!$C$4:$C$2003,様式３!$D18,申請者リスト!$P$4:$P$2003,L$8)","v":0},{"$f":"COUNTIFS(申請者リスト!$C$4:$C$2003,様式３!$D18,申請者リスト!$P$4:$P$2003,M$8)","v":0},0]
[10,null,null,null,{"$f":"IFERROR(YEAR(VLOOKUP($D19,申請者リスト!$C$4:$Q$2003,7,FALSE)),\"\")","v":""},"・",{"$f":"IFERROR(MONTH(VLOOKUP($D19,申請者リスト!$C$4:$Q$2003,7,FALSE)),\"\")","v":""},"・",{"$f":"IFERROR(DAY(VLOOKUP($D19,申請者リスト!$C$4:$Q$2003,7,FALSE)),\"\")","v":""},{"$f":"COUNTIFS(申請者リスト!$C$4:$C$2003,様式３!$D19,申請者リスト!$P$4:$P$2003,J$8)","v":0},{"$f":"COUNTIFS(申請者リスト!$C$4:$C$2003,様式３!$D19,申請者リスト!$P$4:$P$2003,K$8)","v":0},{"$f":"COUNTIFS(申請者リスト!$C$4:$C$2003,様式３!$D19,申請者リスト!$P$4:$P$2003,L$8)","v":0},{"$f":"COUNTIFS(申請者リスト!$C$4:$C$2003,様式３!$D19,申請者リスト!$P$4:$P$2003,M$8)","v":0},0]
[11,null,null,null,{"$f":"IFERROR(YEAR(VLOOKUP($D20,申請者リスト!$C$4:$Q$2003,7,FALSE)),\"\")","v":""},"・",{"$f":"IFERROR(MONTH(VLOOKUP($D20,申請者リスト!$C$4:$Q$2003,7,FALSE)),\"\")","v":""},"・",{"$f":"IFERROR(DAY(VLOOKUP($D20,申請者リスト!$C$4:$Q$2003,7,FALSE)),\"\")","v":""},{"$f":"COUNTIFS(申請者リスト!$C$4:$C$2003,様式３!$D20,申請者リスト!$P$4:$P$2003,J$8)","v":0},{"$f":"COUNTIFS(申請者リスト!$C$4:$C$2003,様式３!$D20,申請者リスト!$P$4:$P$2003,K$8)","v":0},{"$f":"COUNTIFS(申請者リスト!$C$4:$C$2003,様式３!$D20,申請者リスト!$P$4:$P$2003,L$8)","v":0},{"$f":"COUNTIFS(申請者リスト!$C$4:$C$2003,様式３!$D20,申請者リスト!$P$4:$P$2003,M$8)","v":0},0]
{"$rows_left_out":460}
{"sheet":"様式６","index":3,"n_rows":431,"n_cols":16,"rows_kept":431,"cut":false,"hidden":false,"merged":[[0,7,0,8],[2,1,2,15],[3,8,3,13],[5,1,7,1],[5,2,7,2],[5,3,7,3],[5,4,7,4],[5,5,7,9],[5,10,5,13],[5,14,7,14],[5,15,7,15],[27,7,27,8],[29,1,29,15],[30,8,30,13],[32,1,34,1],[32,2,34,2],[32,3,34,3],[32,4,34,4],[32,5,34,9],[32,10,32,13],[59,10,59,13],[59,14,61,14],[59,15,61,15],[81,7,81,8],[83,1,83,15],[84,8,84,13],[32,14,34,14],[32,15,34,15],[54,7,54,8],[56,1,56,15],[57,8,57,13],[59,1,61,1],[59,2,61,2],[59,3,61,3],[59,4,61,4],[59,5,61,9],[113,10,113,13],[113,14,115,14],[113,15,115,15],[135,7,135,8],[137,1,137,15],[138,8,138,13],[86,14,88,14],[86,15,88,15],[108,7,108,8],[110,1,110,15],[111,8,111,13],[113,1,115,1],[113,2,115,2],[113,3,115,3],[113,4,115,4],[113,5,115,9],[86,1,88,1],[86,2,88,2],[86,3,88,3],[86,4,88,4],[86,5,88,9],[86,10,86,13],[167,10,167,13],[167,14,169,14],[167,15,169,15],[189,7,189,8],[191,1,191,15],[192,8,192,13],[140,14,142,14],[140,15,142,15],[162,7,162,8],[164,1,164,15],[165,8,165,13],[167,1,169,1],[167,2,169,2],[167,3,169,3],[167,4,169,4],[167,5,169,9],[140,1,142,1],[140,2,142,2],[140,3,142,3],[140,4,142,4],[140,5,142,9],[140,10,140,13],[221,10,221,13],[221,14,223,14],[221,15,223,15],[243,7,243,8],[245,1,245,15],[246,8,246,13],[194,14,196,14],[194,15,196,15],[216,7,216,8],[218,1,218,15],[219,8,219,13],[221,1,223,1],[221,2,223,2],[221,3,223,3],[221,4,223,4],[221,5,223,9],[194,1,196,1],[194,2,196,2],[194,3,196,3],[194,4,196,4],[194,5,196,9],[194,10,194,13],[275,10,275,13],[275,14,277,14],[275,15,277,15],[297,7,297,8],[299,1,299,15],[300,8,300,13],[248,14,250,14],[248,15,250,15],[270,7,270,8],[272,1,272,15],[273,8,273,13],[275,1,277,1],[275,2,277,2],[275,3,277,3],[275,4,277,4],[275,5,277,9],[248,1,250,1],[248,2,250,2],[248,3,250,3],[248,4,250,4],[248,5,250,9],[248,10,248,13],[329,10,329,13],[329,14,331,14],[329,15,331,15],[351,7,351,8],[353,1,353,15],[354,8,354,13],[302,14,304,14],[302,15,304,15],[324,7,324,8],[326,1,326,15],[327,8,327,13],[329,1,331,1],[329,2,331,2],[329,3,331,3],[329,4,331,4],[329,5,331,9],[302,1,304,1],[302,2,304,2],[302,3,304,3],[302,4,304,4],[302,5,304,9],[302,10,302,13],[356,14,358,14],[356,15,358,15],[378,7,378,8],[380,1,380,15],[381,8,381,13],[383,1,385,1],[383,2,385,2],[383,3,385,3],[383,4,385,4],[383,5,385,9],[356,1,358,1],[356,2,358,2],[356,3,358,3],[356,4,358,4],[356,5,358,9],[356,10,356,13],[410,14,412,14],[410,15,412,15],[410,1,412,1],[410,2,412,2],[410,3,412,3],[410,4,412,4],[410,5,412,9],[410,10,410,13],[383,10,383,13],[383,14,385,14],[383,15,385,15],[405,7,405,8],[407,1,407,15],[408,8,408,13]]}
[null,"（様式６）",null,null,null,null,null,"（令和",null,null,"年度",null,null,"枚中",1,"枚目）"]
[]
[null,"埼玉県高校生専門資格等取得表彰証書発行台帳"]
[null,null,null,null,null,"学 校 名　　　　　　　　　　　",null,null,null,null,null,null,null,null,"学校"]
[null,null,null,null,null,"発行年月日 令和　　",null,null,null,null,null,"年",null,"月",null,"日"]
[null,"発行番号","学年　　　　　　　　　　　　　　　　　　　","学科","整理番号","生  年  月  日",null,null,null,null,"資格・試験等ﾗﾝｸ",null,null,null,"得点\n合計","備考"]
[null,null,null,null,null,null,null,null,null,null,"A","B","C","D"]
[null,null,null,null,null,null,null,null,null,null,6,3,2,1]
[1,null,{"$f":"IF(様式３!B10=\"\",\"\",様式３!B10)","v":""},{"$f":"IF(様式３!C10=\"\",\"\",様式３!C10)","v":""},{"$f":"IF(様式３!D10=\"\",\"\",様式３!D10)","v":""},{"$f":"IF(様式３!E10=\"\",\"\",様式３!E10)","v":""},{"$f":"IF(様式３!F10=\"\",\"\",様式３!F10)","v":"・"},{"$f":"IF(様式３!G10=\"\",\"\",様式３!G10)","v":""},{"$f":"IF(様式３!H10=\"\",\"\",様式３!H10)","v":"・"},{"$f":"IF(様式３!I10=\"\",\"\",様式３!I10)","v":""},{"$f":"IF(様式３!J10=\"\",\"\",様式３!J10)","v":0},{"$f":"IF(様式３!K10=\"\",\"\",様式３!K10)","v":0},{"$f":"IF(様式３!L10=\"\",\"\",様式３!L10)","v":0},{"$f":"IF(様式３!M10=\"\",\"\",様式３!M10)","v":0},{"$f":"IF(様式３!N10=\"\",\"\",様式３!N10)","v":0},{"$f":"IF(様式３!O10=\"\",\"\",様式３!O10)","v":""}]
[2,{"$f":"IF(E10=\"\",\"\",B9+1)","v":""},{"$f":"IF(様式３!B11=\"\",\"\",様式３!B11)","v":""},{"$f":"IF(様式３!C11=\"\",\"\",様式３!C11)","v":""},{"$f":"IF(様式３!D11=\"\",\"\",様式３!D11)","v":""},{"$f":"IF(様式３!E11=\"\",\"\",様式３!E11)","v":""},{"$f":"IF(様式３!F11=\"\",\"\",様式３!F11)","v":"・"},{"$f":"IF(様式３!G11=\"\",\"\",様式３!G11)","v":""},{"$f":"IF(様式３!H11=\"\",\"\",様式３!H11)","v":"・"},{"$f":"IF(様式３!I11=\"\",\"\",様式３!I11)","v":""},{"$f":"IF(様式３!J11=\"\",\"\",様式３!J11)","v":0},{"$f":"IF(様式３!K11=\"\",\"\",様式３!K11)","v":0},{"$f":"IF(様式３!L11=\"\",\"\",様式３!L11)","v":0},{"$f":"IF(様式３!M11=\"\",\"\",様式３!M11)","v":0},{"$f":"IF(様式３!N11=\"\",\"\",様式３!N11)","v":0},{"$f":"IF(様式３!O11=\"\",\"\",様式３!O11)","v":""}]
[3,{"$f":"IF(E11=\"\",\"\",B10+1)","v":""},{"$f":"IF(様式３!B12=\"\",\"\",様式３!B12)","v":""},{"$f":"IF(様式３!C12=\"\",\"\",様式３!C12)","v":""},{"$f":"IF(様式３!D12=\"\",\"\",様式３!D12)","v":""},{"$f":"IF(様式３!E12=\"\",\"\",様式３!E12)","v":""},{"$f":"IF(様式３!F12=\"\",\"\",様式３!F12)","v":"・"},{"$f":"IF(様式３!G12=\"\",\"\",様式３!G12)","v":""},{"$f":"IF(様式３!H12=\"\",\"\",様式３!H12)","v":"・"},{"$f":"IF(様式３!I12=\"\",\"\",様式３!I12)","v":""},{"$f":"IF(様式３!J12=\"\",\"\",様式３!J12)","v":0},{"$f":"IF(様式３!K12=\"\",\"\",様式３!K12)","v":0},{"$f":"IF(様式３!L12=\"\",\"\",様式３!L12)","v":0},{"$f":"IF(様式３!M12=\"\",\"\",様式３!M12)","v":0},{"$f":"IF(様式３!N12=\"\",\"\",様式３!N12)","v":0},{"$f":"IF(様式３!O12=\"\",\"\",様式３!O12)","v":""}]
[4,"",{"$f":"IF(様式３!B13=\"\",\"\",様式３!B13)","v":""},{"$f":"IF(様式３!C13=\"\",\"\",様式３!C13)","v":""},{"$f":"IF(様式３!D13=\"\",\"\",様式３!D13)","v":""},{"$f":"IF(様式３!E13=\"\",\"\",様式３!E13)","v":""},{"$f":"IF(様式３!F13=\"\",\"\",様式３!F13)","v":"・"},{"$f":"IF(様式３!G13=\"\",\"\",様式３!G13)","v":""},{"$f":"IF(様式３!H13=\"\",\"\",様式３!H13)","v":"・"},{"$f":"IF(様式３!I13=\"\",\"\",様式３!I13)","v":""},{"$f":"IF(様式３!J13=\"\",\"\",様式３!J13)","v":0},{"$f":"IF(様式３!K13=\"\",\"\",様式３!K13)","v":0},{"$f":"IF(様式３!L13=\"\",\"\",様式３!L13)","v":0},{"$f":"IF(様式３!M13=\"\",\"\",様式３!M13)","v":0},{"$f":"IF(様式３!N13=\"\",\"\",様式３!N13)","v":0},{"$f":"IF(様式３!O13=\"\",\"\",様式３!O13)","v":""}]
[5,"",{"$f":"IF(様式３!B14=\"\",\"\",様式３!B14)","v":""},{"$f":"IF(様式３!C14=\"\",\"\",様式３!C14)","v":""},{"$f":"IF(様式３!D14=\"\",\"\",様式３!D14)","v":""},{"$f":"IF(様式３!E14=\"\",\"\",様式３!E14)","v":""},{"$f":"IF(様式３!F14=\"\",\"\",様式３!F14)","v":"・"},{"$f":"IF(様式３!G14=\"\",\"\",様式３!G14)","v":""},{"$f":"IF(様式３!H14=\"\",\"\",様式３!H14)","v":"・"},{"$f":"IF(様式３!I14=\"\",\"\",様式３!I14)","v":""},{"$f":"IF(様式３!J14=\"\",\"\",様式３!J14)","v":0},{"$f":"IF(様式３!K14=\"\",\"\",様式３!K14)","v":0},{"$f":"IF(様式３!L14=\"\",\"\",様式３!L14)","v":0},{"$f":"IF(様式３!M14=\"\",\"\",様式３!M14)","v":0},{"$f":"IF(様式３!N14=\"\",\"\",様式３!N14)","v":0},{"$f":"IF(様式３!O14=\"\",\"\",様式３!O14)","v":""}]
[6,"",{"$f":"IF(様式３!B15=\"\",\"\",様式３!B15)","v":""},{"$f":"IF(様式３!C15=\"\",\"\",様式３!C15)","v":""},{"$f":"IF(様式３!D15=\"\",\"\",様式３!D15)","v":""},{"$f":"IF(様式３!E15=\"\",\"\",様式３!E15)","v":""},{"$f":"IF(様式３!F15=\"\",\"\",様式３!F15)","v":"・"},{"$f":"IF(様式３!G15=\"\",\"\",様式３!G15)","v":""},{"$f":"IF(様式３!H15=\"\",\"\",様式３!H15)","v":"・"},{"$f":"IF(様式３!I15=\"\",\"\",様式３!I15)","v":""},{"$f":"IF(様式３!J15=\"\",\"\",様式３!J15)","v":0},{"$f":"IF(様式３!K15=\"\",\"\",様式３!K15)","v":0},{"$f":"IF(様式３!L15=\"\",\"\",様式３!L15)","v":0},{"$f":"IF(様式３!M15=\"\",\"\",様式３!M15)","v":0},{"$f":"IF(様式３!N15=\"\",\"\",様式３!N15)","v":0},{"$f":"IF(様式３!O15=\"\",\"\",様式３!O15)","v":""}]
[7,"",{"$f":"IF(様式３!B16=\"\",\"\",様式３!B16)","v":""},{"$f":"IF(様式３!C16=\"\",\"\",様式３!C16)","v":""},{"$f":"IF(様式３!D16=\"\",\"\",様式３!D16)","v":""},{"$f":"IF(様式３!E16=\"\",\"\",様式３!E16)","v":""},{"$f":"IF(様式３!F16=\"\",\"\",様式３!F16)","v":"・"},{"$f":"IF(様式３!G16=\"\",\"\",様式３!G16)","v":""},{"$f":"IF(様式３!H16=\"\",\"\",様式３!H16)","v":"・"},{"$f":"IF(様式３!I16=\"\",\"\",様式３!I16)","v":""},{"$f":"IF(様式３!J16=\"\",\"\",様式３!J16)","v":0},{"$f":"IF(様式３!K16=\"\",\"\",様式３!K16)","v":0},{"$f":"IF(様式３!L16=\"\",\"\",様式３!L16)","v":0},{"$f":"IF(様式３!M16=\"\",\"\",様式３!M16)","v":0},{"$f":"IF(様式３!N16=\"\",\"\",様式３!N16)","v":0},{"$f":"IF(様式３!O16=\"\",\"\",様式３!O16)","v":""}]
[8,"",{"$f":"IF(様式３!B17=\"\",\"\",様式３!B17)","v":""},{"$f":"IF(様式３!C17=\"\",\"\",様式３!C17)","v":""},{"$f":"IF(様式３!D17=\"\",\"\",様式３!D17)","v":""},{"$f":"IF(様式３!E17=\"\",\"\",様式３!E17)","v":""},{"$f":"IF(様式３!F17=\"\",\"\",様式３!F17)","v":"・"},{"$f":"IF(様式３!G17=\"\",\"\",様式３!G17)","v":""},{"$f":"IF(様式３!H17=\"\",\"\",様式３!H17)","v":"・"},{"$f":"IF(様式３!I17=\"\",\"\",様式３!I17)","v":""},{"$f":"IF(様式３!J17=\"\",\"\",様式３!J17)","v":0},{"$f":"IF(様式３!K17=\"\",\"\",様式３!K17)","v":0},{"$f":"IF(様式３!L17=\"\",\"\",様式３!L17)","v":0},{"$f":"IF(様式３!M17=\"\",\"\",様式３!M17)","v":0},{"$f":"IF(様式３!N17=\"\",\"\",様式３!N17)","v":0},{"$f":"IF(様式３!O17=\"\",\"\",様式３!O17)","v":""}]
[9,"",{"$f":"IF(様式３!B18=\"\",\"\",様式３!B18)","v":""},{"$f":"IF(様式３!C18=\"\",\"\",様式３!C18)","v":""},{"$f":"IF(様式３!D18=\"\",\"\",様式３!D18)","v":""},{"$f":"IF(様式３!E18=\"\",\"\",様式３!E18)","v":""},{"$f":"IF(様式３!F18=\"\",\"\",様式３!F18)","v":"・"},{"$f":"IF(様式３!G18=\"\",\"\",様式３!G18)","v":""},{"$f":"IF(様式３!H18=\"\",\"\",様式３!H18)","v":"・"},{"$f":"IF(様式３!I18=\"\",\"\",様式３!I18)","v":""},{"$f":"IF(様式３!J18=\"\",\"\",様式３!J18)","v":0},{"$f":"IF(様式３!K18=\"\",\"\",様式３!K18)","v":0},{"$f":"IF(様式３!L18=\"\",\"\",様式３!L18)","v":0},{"$f":"IF(様式３!M18=\"\",\"\",様式３!M18)","v":0},{"$f":"IF(様式３!N18=\"\",\"\",様式３!N18)","v":0},{"$f":"IF(様式３!O18=\"\",\"\",様式３!O18)","v":""}]
[10,"",{"$f":"IF(様式３!B19=\"\",\"\",様式３!B19)","v":""},{"$f":"IF(様式３!C19=\"\",\"\",様式３!C19)","v":""},{"$f":"IF(様式３!D19=\"\",\"\",様式３!D19)","v":""},{"$f":"IF(様式３!E19=\"\",\"\",様式３!E19)","v":""},{"$f":"IF(様式３!F19=\"\",\"\",様式３!F19)","v":"・"},{"$f":"IF(様式３!G19=\"\",\"\",様式３!G19)","v":""},{"$f":"IF(様式３!H19=\"\",\"\",様式３!H19)","v":"・"},{"$f":"IF(様式３!I19=\"\",\"\",様式３!I19)","v":""},{"$f":"IF(様式３!J19=\"\",\"\",様式３!J19)","v":0},{"$f":"IF(様式３!K19=\"\",\"\",様式３!K19)","v":0},{"$f":"IF(様式３!L19=\"\",\"\",様式３!L19)","v":0},{"$f":"IF(様式３!M19=\"\",\"\",様式３!M19)","v":0},{"$f":"IF(様式３!N19=\"\",\"\",様式３!N19)","v":0},{"$f":"IF(様式３!O19=\"\",\"\",様式３!O19)","v":""}]
[11,"",{"$f":"IF(様式３!B20=\"\",\"\",様式３!B20)","v":""},{"$f":"IF(様式３!C20=\"\",\"\",様式３!C20)","v":""},{"$f":"IF(様式３!D20=\"\",\"\",様式３!D20)","v":""},{"$f":"IF(様式３!E20=\"\",\"\",様式３!E20)","v":""},{"$f":"IF(様式３!F20=\"\",\"\",様式３!F20)","v":"・"},{"$f":"IF(様式３!G20=\"\",\"\",様式３!G20)","v":""},{"$f":"IF(様式３!H20=\"\",\"\",様式３!H20)","v":"・"},{"$f":"IF(様式３!I20=\"\",\"\",様式３!I20)","v":""},{"$f":"IF(様式３!J20=\"\",\"\",様式３!J20)","v":0},{"$f":"IF(様式３!K20=\"\",\"\",様式３!K20)","v":0},{"$f":"IF(様式３!L20=\"\",\"\",様式３!L20)","v":0},{"$f":"IF(様式３!M20=\"\",\"\",様式３!M20)","v":0},{"$f":"IF(様式３!N20=\"\",\"\",様式３!N20)","v":0},{"$f":"IF(様式３!O20=\"\",\"\",様式３!O20)","v":""}]
[12,"",{"$f":"IF(様式３!B21=\"\",\"\",様式３!B21)","v":""},{"$f":"IF(様式３!C21=\"\",\"\",様式３!C21)","v":""},{"$f":"IF(様式３!D21=\"\",\"\",様式３!D21)","v":""},{"$f":"IF(様式３!E21=\"\",\"\",様式３!E21)","v":""},{"$f":"IF(様式３!F21=\"\",\"\",様式３!F21)","v":"・"},{"$f":"IF(様式３!G21=\"\",\"\",様式３!G21)","v":""},{"$f":"IF(様式３!H21=\"\",\"\",様式３!H21)","v":"・"},{"$f":"IF(様式３!I21=\"\",\"\",様式３!I21)","v":""},{"$f":"IF(様式３!J21=\"\",\"\",様式３!J21)","v":0},{"$f":"IF(様式３!K21=\"\",\"\",様式３!K21)","v":0},{"$f":"IF(様式３!L21=\"\",\"\",様式３!L21)","v":0},{"$f":"IF(様式３!M21=\"\",\"\",様式３!M21)","v":0},{"$f":"IF(様式３!N21=\"\",\"\",様式３!N21)","v":0},{"$f":"IF(様式３!O21=\"\",\"\",様式３!O21)","v":""}]
{"$rows_left_out":411}