{"text_format":"1","workbook":"xlsx","n_sheets":20,"sheets":["表紙","判別法","事前相談入力シート","事前相談チェックシート","事前相談書","コントロールシート（貯留＋浸透）","ピーク流量算定表","施設諸元（ポンプ）","比浸透量","施設諸元（浸透）","施設諸元（浸透_道路管理者用）","調節計算結果","許可申請書","計画説明書","mkrain","runoff","逐次計算（概算）","浸透計算","逐次計算（浸透考慮）","調節計算（ポンプ）"],"not_rendered":{"charts":1,"images":5,"macros":1,"external_links":0,"defined_names":12,"comments":0,"pivot_tables":0},"unopened":[],"bounds":{"document_bytes":16777216,"sheet_cells":100000,"rows_first":2000,"rows_last":500,"rows_between":2000,"halvings":0,"cell_chars":16384,"cell_head_chars":4096},"cells_cut":0,"cells_raw":0,"read":"whole","date_system":"1900"}

{"sheet":"表紙","index":0,"n_rows":45,"n_cols":7,"rows_kept":45,"cut":false,"hidden":false,"merged":[[44,6,48,24],[10,1,11,29],[13,4,14,26]]}
[]
[]
[]
[]
[]
[]
[]
[]
[]
[]
[null,"【中川・綾瀬川流域（埼玉県版）】調整池容量計算システム"]
[]
[]
[]
[]
[]
[]
[]
[]
[]
[]
[]
[]
[]
[]
[]
[]
[]
[]
[]
[]
[]
[]
[]
[]
[]
[]
[]
[]
[]
[]
[]
[]
[]
[null,null,null,null,null,null,"令和７年３月\n\n中川・綾瀬川流域水害対策協議会"]

{"sheet":"判別法","index":1,"n_rows":0,"n_cols":0,"rows_kept":0,"cut":false,"hidden":false,"merged":[]}

{"sheet":"事前相談入力シート","index":2,"n_rows":54,"n_cols":24,"rows_kept":54,"cut":false,"hidden":false,"merged":[[5,3,11,3],[23,2,23,20],[5,16,11,16],[3,1,11,1],[46,21,46,22],[28,21,34,21],[28,22,34,22],[25,1,25,22],[26,21,27,22],[28,12,34,12],[5,17,11,17],[5,9,11,9],[5,10,11,10],[5,13,11,13],[5,14,11,14],[5,15,11,15],[3,18,4,20],[28,19,34,19],[28,7,34,7],[28,8,34,8],[28,9,34,9],[28,17,34,17],[28,18,34,18],[26,1,34,1],[26,13,27,14],[28,14,34,14],[28,15,34,15],[28,16,34,16],[53,16,55,20],[28,20,34,20],[46,2,46,20],[26,15,27,17],[26,18,27,20],[28,2,34,2],[28,3,34,3],[28,4,34,4],[28,5,34,5],[28,6,34,6],[28,10,34,10],[28,11,34,11],[28,13,34,13],[26,2,27,12],[50,16,50,20],[51,16,52,20],[1,4,1,11],[5,19,11,19],[5,20,11,20],[5,18,11,18],[3,13,4,14],[3,15,4,17],[5,4,11,4],[5,5,11,5],[3,2,4,12],[5,11,11,11],[5,12,11,12],[5,6,11,6],[5,7,11,7],[5,8,11,8],[2,1,2,20],[5,2,11,2]]}
[]
[null,"事前相談入力シート",null,null,"法第３０条の対策の対象とする面積に対して入力してください（※）",null,null,null,null,null,null,null,null,null,null,null,null,null,null,null,null,null,null,"【提出様式】"]
[null,"現況土地利用(ha) 【行為前】"]
[null,"エリアNo","宅地等",null,null,null,null,null,null,null,null,null,null,"舗装された土地",null,"その他土地からの流出雨水量を増加させるおそれのある行為に係る土地",null,null,"左記以外の土地"]
[]
[null,null,"宅地","池沼","水路","ため池","道路（法面を有しないものに限る。）","道路（法面を有するものに限る。）","鉄道線路（法面を有しないものに限る。）","鉄道線路（法面を有するものに限る。）","飛行場（法面を有しないものに限る。）","飛行場（法面を有するものに限る。）","太陽光\nパネル","コンクリート等の不浸透性の材料により覆われた土地（法面を除く）","コンクリート等の不浸透性の材料により覆われた法面","ゴルフ場（雨水を排除するための排水施設を伴うもの）","運動場その他これに類する施設（雨水を排除するための排水施設を伴うものに限る）","ローラーその他これに類する建設機械を用いて締め固められた土地","山地","人工的に造成された植生に覆われた法面","林地、耕地、原野その他ローラーその他これに類する建設機械を用いていない土地"]
[]
[]
[]
[]
[]
[]
[null,"①"]
[null,"②"]
[null,"③"]
[null,"④"]
[null,"⑤"]
[null,"⑥"]
[null,"⑦"]
[null,"⑧"]
[null,"⑨"]
[null,"⑩"]
[null,"小計",{"$f":"SUM(C13:C22)","v":0},0,0,0,0,0,0,0,0,0,0,0,0,0,0,0,0,0,0]
[null,"合　計",{"$f":"SUM(C23:U23)","v":0}]
[]
[null,"計画土地利用(ha) 【行為後】"]
[null,"エリアNo","宅地等",null,null,null,null,null,null,null,null,null,null,"舗装された土地",null,"その他土地からの流出雨水量を増加させるおそれのある行為に係る土地",null,null,"左記以外の土地",null,null,"埼玉県雨水流出抑制施設の設置等に関する条例に関する除外区域"]
[]
[null,null,"宅地","池沼","水路","ため池","道路（法面を有しないものに限る。）","道路（法面を有するものに限る。）","鉄道線路（法面を有しないものに限る。）","鉄道線路（法面を有するものに限る。）","飛行場（法面を有しないものに限る。）","飛行場（法面を有するものに限る。）","太陽光\nパネル","コンクリート等の不浸透性の材料により覆われた土地（法面を除く）","コンクリート等の不浸透性の材料により覆われた法面","ゴルフ場（雨水を排除するための排水施設を伴うもの）","運動場その他これに類する施設（雨水を排除するための排水施設を伴うものに限る）","ローラーその他これに類する建設機械を用いて締め固められた土地","山地","人工的に造成された植生に覆われた法面","林地、耕地、原野その他ローラーその他これに類する建設機械を用いていない土地","生産緑地法に基づく緑地","森林法に基づく残置森林"]
[]
[]
[]
[]
[]
[]
[null,"①"]
[null,"②"]
[null,"③"]
[null,"④"]
[null,"⑤"]
[null,"⑥"]
[null,"⑦"]
[null,"⑧"]
[null,"⑨"]
[null,"⑩"]
[null,"小計",{"$f":"SUM(C36:C45)","v":0},0,0,0,0,0,0,0,0,0,0,0,0,0,0,0,0,0,0,{"$f":"SUM(V36:V45)","v":0},{"$f":"SUM(W36:W45)","v":0}]
[null,"合　計",{"$f":"SUM(C46:U46)","v":0},null,null,null,null,null,null,null,null,null,null,null,null,null,null,null,null,null,null,{"$f":"SUM(V46:W46)","v":0}]
[]
[]
[]
[null,null,null,null,null,null,null,null,null,null,null,null,null,null,null,null,"入力データの整合チェック"]
[null,null,null,null,null,null,null,null,null,null,null,null,null,null,null,null,{"$f":"IF(C24=C47,IF(C24<>0,\"OK\",\"NG\"),\"NG\")","v":"NG"}]
[]
[null,null,null,null,null,null,null,null,null,null,null,null,null,null,null,null,{"$f":"IF(Q52=\"NG\",\"開発前後の面積が異なるか、面積が未入力です。\",\"\")","v":"開発前後の面積が異なるか、面積が未入力です。"}]

{"sheet":"事前相談チェックシート","index":3,"n_rows":30,"n_cols":28,"rows_kept":30,"cut":false,"hidden":false,"merged":[[13,3,13,9],[4,1,15,2],[16,1,18,2],[14,3,14,9],[4,3,4,9],[5,3,5,9],[6,3,6,9],[7,3,7,9],[16,3,16,9],[17,3,17,9],[15,3,15,9],[18,3,18,9],[2,1,3,9],[12,3,12,9],[9,3,9,9],[10,3,10,9],[11,3,11,9],[8,3,8,9],[5,20,5,22],[23,21,23,23],[2,16,2,18],[23,14,26,14],[23,18,23,19],[7,16,7,18],[13,20,14,22],[26,16,27,16],[26,17,27,17],[24,18,27,19],[24,20,27,20],[24,21,27,23],[17,16,17,18],[29,9,29,14],[28,1,28,9],[27,1,27,9],[19,1,22,2],[19,3,19,9],[20,3,20,9],[21,3,21,9],[23,1,26,2],[23,3,23,9],[22,3,22,9],[24,3,24,9],[25,3,25,9],[26,3,26,9]]}
[]
[null,"事前相談チェックシート",null,null,null,null,null,null,null,null,null,null,null,null,null,null,null,null,null,null,null,null,"【提出様式】"]
[null,"土　地　利　用　区　分",null,null,1.6069045212187549E+44,null,null,null,null,null,"流出係数","①現況土地利用【行為前】","②計画土地利用【行為後】","③面積差","雨水浸透阻害行為の\n該当面積",null,"各対象面積集計",null,null,null,"対象地域※２"]
[null,null,null,null,null,null,null,null,null,null,"―","面積（ha）","面積（ha）","（ha）②－①","面積（ha）③欄が\n（＋）の場合",null,"開発区域面積※１",null,"(ha)",null,null,null,null,null,null,null,"埼玉県北部",0.47039999999999998]
[null,"宅地等",null,"宅　　　地",null,null,null,null,null,null,0.9,{"$f":"事前相談入力シート!C23","v":0},{"$f":"事前相談入力シート!C46","v":0},{"$f":"M5-L5","v":0},{"$f":"MAX(N5,0)","v":0},null,"法第30条の対策の対象とする面積",{"$f":"事前相談入力シート!C47","v":0},"(ha)",null,true,null,null,null,null,null,"埼玉県南部",0.43090000000000001]
[null,null,null,"池　　　沼",null,null,null,null,null,null,1,{"$f":"事前相談入力シート!D23","v":0},{"$f":"事前相談入力シート!D46","v":0},0,{"$f":"MAX(N6,0)","v":0},null,"開発区域面積から「対策の対象とならない面積」を引いた面積",{"$f":"IF(R4>=1,R4-V17,R4-V8)","v":0},"(ha)",null,"都市計画法に基づく開発指導等としての\n必要対策量(開発区域面積1ha未満)"]
[null,null,null,"水　　　路",null,null,null,null,null,null,1,{"$f":"事前相談入力シート!E23","v":0},{"$f":"事前相談入力シート!E46","v":0},0,0,null,null,null,null,null,"対策基準",null,"m3/ha"]
[null,null,null,"た  め　池",null,null,null,null,null,null,1,{"$f":"事前相談入力シート!F23","v":0},{"$f":"事前相談入力シート!F46","v":0},0,0,null,"特定都市河川浸水被害対策法\n第30条の必要対策量",null,null,null,"対策の対象とならない面積\n（控除面積）※４",null,"ha",null,null,null,null,{"$f":"IF(U4=AA4,AB4,IF(U4=AA5,AB5,IF(U4=AA6,AB6,AB7)))","v":0}]
[null,null,null,"道路（法面を有しないものに限る。）",null,null,null,null,null,null,0.9,{"$f":"事前相談入力シート!G23","v":0},{"$f":"事前相談入力シート!G46","v":0},0,0,null,"調整池深さ※３",null,"m",null,"許容比流量※５",null,"m3/s/ha"]
[null,null,null,"道路（法面を有するものに限る。）",null,null,null,null,null,null,null,{"$f":"事前相談入力シート!H23","v":0},{"$f":"事前相談入力シート!H46","v":0},0,0,null,"行為前の流出係数",{"$f":"L29","v":{"$error":"#DIV/0!"}},null,null,"許容放流量※６ ⑤\n(許容比流量×集水面積)",null,"m3/s"]
[null,null,null,"鉄道線路（法面を有しないものに限る。）",null,null,null,null,null,null,0.9,{"$f":"事前相談入力シート!I23","v":0},{"$f":"事前相談入力シート!I46","v":0},0,0,null,"行為前の流出雨水量（許容放流量） ④",{"$f":"runoff!B1","v":{"$error":"#DIV/0!"}},"m3/s",null,"オリフィス径（円・直径）",{"$f":"AA11","v":0},"m",null,null,null,0]
[null,null,null,"鉄道線路（法面を有するものに限る。）",null,null,null,null,null,null,null,{"$f":"事前相談入力シート!J23","v":0},{"$f":"事前相談入力シート!J46","v":0},0,0,null,"行為後の流出係数",{"$f":"M29","v":{"$error":"#DIV/0!"}},null,null,"必要対策量 ②",{"$f":"IF(U5=TRUE,\"不要\",IF(R26=\"不要\",\"不要\",ROUND(V7*R6,0)))","v":"不要"},"m3"]
[null,null,null,"飛行場（法面を有しないものに限る。）",null,null,null,null,null,null,0.9,{"$f":"事前相談入力シート!K23","v":0},{"$f":"事前相談入力シート!K46","v":0},0,0,null,"行為後の流出雨水量（未対策）",{"$f":"runoff!C1","v":{"$error":"#DIV/0!"}},"m3/s"]
[null,null,null,"飛行場（法面を有するものに限る。）",null,null,null,null,null,null,null,{"$f":"事前相談入力シート!L23","v":0},{"$f":"事前相談入力シート!L46","v":0},0,0,null,"オリフィス径(円・直径)",{"$f":"AA14","v":0.34399999999999997},"m",null,"都市計画法に基づく開発指導等としての\n必要対策量（開発区域面積1ha以上）\n【埼玉県雨水流出抑制施設の設置等に関する条例】",null,null,null,null,null,0.34399999999999997]
[null,null,null,"太陽光パネル",null,null,null,null,null,null,0.9,{"$f":"事前相談入力シート!M23","v":0},{"$f":"事前相談入力シート!M46","v":0},0,0,null,"haあたり必要対策量（概算）",{"$f":"AA15","v":1070},"m3/ha",null,null,null,null,null,null,null,1070]
[null,null,null,"小　　　計",null,null,null,null,null,null,null,{"$f":"SUM(L5:L15)","v":0},{"$f":"SUM(M5:M15)","v":0},0,{"$f":"SUM(O5:O15)","v":0},null,"必要対策量（概算） ①",{"$f":"IF(O28<0.1,\"不要\",R15*R5)","v":"不要"},"m3",null,"対策基準（地域別調整容量）",null,"m3/ha"]
[null,"舗装された土地",null,"コンクリート等の不浸透性の材料により覆われた土地（法面を除く）",null,null,null,null,null,null,0.95,{"$f":"事前相談入力シート!N23","v":0},{"$f":"事前相談入力シート!N46","v":0},0,0,null,null,null,null,null,"対策の対象とならない面積\n（控除面積）※４",null,"ha"]
[null,null,null,"コンクリート等の不浸透性の材料により覆われた法面",null,null,null,null,null,null,1,{"$f":"事前相談入力シート!O23","v":0},{"$f":"事前相談入力シート!O46","v":0},0,0,null,"下水道等の一時放流先との協議によるもの",null,null,null,"湛水区域対策量※７",null,"m3"]
[null,null,null,"小　　　計",null,null,null,null,null,null,null,{"$f":"SUM(L17:L18)","v":0},{"$f":"SUM(M17:M18)","v":0},0,{"$f":"SUM(O17:O18)","v":0},null,"許容比流量※８",null,"m3/s/ha",null,"許容比流量※５（≦0.05）",0.05,"m3/s/ha"]
[null,"その他土地からの流出雨水量を増加させるおそれのある行為に係る土地",null,"ゴルフ場（雨水を排除するための排水施設を伴うもの）",null,null,null,null,null,null,0.5,{"$f":"事前相談入力シート!P23","v":0},{"$f":"事前相談入力シート!P46","v":0},0,0,null,"許容放流量※６ ⑦\n(許容比流量×集水面積)",null,"m3/s",null,"許容放流量※６ ⑥\n(許容比流量×集水面積)",null,"m3/s"]
[null,null,null,"運動場その他これに類する施設（雨水を排除するための排水施設を伴うものに限る。",null,null,null,null,null,null,0.8,{"$f":"事前相談入力シート!Q23","v":0},{"$f":"事前相談入力シート!Q46","v":0},0,0,null,null,null,null,null,"オリフィス径（円・直径）",{"$f":"AA21","v":0.35199999999999998},"m",null,null,null,0.35199999999999998]
[null,null,null,"ローラーその他これに類する建設機械を用いて締め固められた土地",null,null,null,null,null,null,0.5,{"$f":"事前相談入力シート!R23","v":0},{"$f":"事前相談入力シート!R46","v":0},0,0,null,null,null,null,null,"必要対策量 ③",{"$f":"IF(U5=TRUE,\"不要\",IF(R27=\"不要\",\"不要\",ROUND(V16*R6+V18,0)))","v":"不要"},"m3"]
[null,null,null,"小　　　計",null,null,null,null,null,null,null,{"$f":"SUM(L20:L22)","v":0},{"$f":"SUM(M20:M22)","v":0},0,{"$f":"SUM(O20:O22)","v":0},null,"都市計画法の開発許可等との調整により双方の機能を兼ね備えた対策工事とする（流出抑制量が大きい方で対策）"]
[null,"上記に揚げる土地以外の土地",null,"山　　　地",null,null,null,null,null,null,0.3,{"$f":"事前相談入力シート!S23","v":0},{"$f":"事前相談入力シート!S46","v":0},0,null,null,"他法令等との調整別の対応","申請","必要対策量(m3)（概算）\n①②③を比べ大きい値",null,"許容放流量(m3/s)\n④⑤⑥⑦を比べ小さい値"]
[null,null,null,"人工的に造成された植生に覆われた法面",null,null,null,null,null,null,0.4,{"$f":"事前相談入力シート!T23","v":0},{"$f":"事前相談入力シート!T46","v":0},0,null,null,"法第30条の許可",{"$f":"IF(O28>=0.1,\"必要\",\"不要\")","v":"不要"},{"$f":"MAX(R16,V12,V22)","v":0},null,{"$f":"MIN(Z25,Z26,Z27,Z28)","v":99999},{"$f":"MIN(AA25,AA26,AA27,AA28)","v":99999},null,null,{"$f":"IF(S25=R16,R14,IF(S25=V12,V11,V21))","v":0.35199999999999998},{"$f":"IF(R25=\"必要\",R11,99999)","v":99999},{"$f":"IF(R14=0,99999,IF(R25=\"必要\",R14,99999))","v":99999}]
[null,null,null,"林地、耕地、原野その他ローラーその他これに類する建設機械を用いていない土地",null,null,null,null,null,null,0.2,{"$f":"事前相談入力シート!U23","v":0},{"$f":"事前相談入力シート!U46","v":0},0,null,null,{"$f":"U6","v":"都市計画法に基づく開発指導等としての\n必要対策量(開発区域面積1ha未満)"},{"$f":"IF(U5=TRUE,\"不要\",IF(AND(R4>=0.05,R4<1),\"必要\",\"不要\"))","v":"不要"},null,null,null,null,null,null,null,{"$f":"IF(V10=0,99999,IF(R26=\"必要\",V10,99999))","v":99999},{"$f":"IF(V11=0,99999,IF(R26=\"必要\",V11,99999))","v":99999}]
[null,null,null,"小　　　計",null,null,null,null,null,null,null,{"$f":"SUM(L24:L26)","v":0},{"$f":"SUM(M24:M26)","v":0},0,null,null,{"$f":"U14","v":"都市計画法に基づく開発指導等としての\n必要対策量（開発区域面積1ha以上）\n【埼玉県雨水流出抑制施設の設置等に関する条例】"},{"$f":"IF(U5=TRUE,\"不要\",IF(R4>=1,\"必要\",\"不要\"))","v":"不要"},null,null,null,null,null,null,null,{"$f":"IF(V20=0,99999,IF(R27=\"必要\",V20,99999))","v":99999},{"$f":"IF(V21=0,99999,IF(R27=\"必要\",V21,99999))","v":99999}]
[null,"合　　　計",null,null,null,null,null,null,null,null,null,{"$f":"L16+L19+L23+L27","v":0},{"$f":"M16+M19+M23+M27","v":0},{"$f":"IF(ABS(M28-L28)<0.000001,\"OK\",\"NG\")","v":"OK"},{"$f":"O16+O19+O23","v":0},null,null,null,null,null,null,null,null,null,null,{"$f":"IF(R20>0,R20,99999)","v":99999},{"$f":"IF(R20=0,99999,ROUND((4*AB28/PI())^0.5,3))","v":99999},{"$f":"R20/0.6/(2*9.8*R9)^0.5","v":{"$error":"#DIV/0!"}}]
[null,"平均流出係数",null,null,null,null,null,null,null,null,null,{"$f":"ROUND((L5*$K5+L6*$K6+L7*$K7+L8*$K8+L9*$K9+L10*$K10+L11*$K11+L12*$K12+L13*$K13+L14*$K14+L15*$K15+L17*$K17+L18*$K18+L20*$K20+L21*$K21+L22*$K22+L24*$K24+L25*$K25+L26*$K26)/L28,3)","v":{"$error":"#DIV/0!"}},{"$f":"ROUND((M5*$K5+M6*$K6+M7*$K7+M8*$K8+M9*$K9+M10*$K10+M11*$K11+M12*$K12+M13*$K13+M14*$K14+M15*$K15+M17*$K17+M18*$K18+M20*$K20+M21*$K21+M22*$K22+M24*$K24+M25*$K25+M26*$K26)/M28,3)","v":{"$error":"#DIV/0!"}}]
[null,null,null,null,null,null,null,null,null,"※雨水浸透阻害行為の該当面積が0.1ha以上の場合、法第30条の許可（協議）が必要です。"]

{"sheet":"事前相談書","index":4,"n_rows":25,"n_cols":32,"rows_kept":25,"cut":false,"hidden":false,"merged":[[24,7,24,10],[24,12,24,13],[0,12,0,13],[16,25,17,25],[17,20,18,24],[18,25,19,25],[7,6,9,13],[10,6,12,13],[13,6,15,13],[16,7,17,13],[18,7,19,13],[16,6,17,6],[5,6,5,13],[17,1,18,5],[18,6,19,6],[20,6,21,6],[22,6,23,6],[20,25,21,25],[22,25,23,25],[20,7,21,13],[22,7,23,13]]}
[null,null,null,null,null,null,null,null,null,null,null,null,"【提出様式】"]
[null,null,null,null,null,null,null,null,null,null,null,"№","－",null,null,null,null,null,null,null,null,null,null,null,null,null,null,null,null,null,"№","－"]
[null,"雨 水 浸 透 阻 害 行 為 事 前 相 談 書",null,null,null,null,null,null,null,null,null,null,null,null,null,null,null,null,null,null,"雨 水 浸 透 阻 害 行 為 事 前 相 談 書"]
[]
[]
[null,"事前相談日時",null,null,null,null,"　　　　　年　　月　　日（　）　：　　～　　：",null,null,null,null,null,null,null,null,null,null,null,null,null,"事前相談日時",null,null,null,null,"　　　○○年○○月○○日（○）XX：XX～　　："]
[]
[]
[null,"事業区域に含まれる地域の名称",null,null,null,null,null,null,null,null,null,null,null,null,null,null,null,null,null,null,"事業区域に含まれる地域の名称",null,null,null,null,"　○○市○○町101番地、102番地、103番地"]
[]
[null,null,null,null,null,null,{"$f":"事前相談チェックシート!R4","v":0}]
[null,"事業区域の面積",null,null,null,null,null,null,null,null,null,null,null,null,null,null,null,null,null,null,"事業区域の面積",null,null,null,null,"　0.250ha"]
[]
[]
[null,"予定する事業の計画の内容",null,null,null,null,null,null,null,null,null,null,null,null,null,null,null,null,null,null,"予定する事業の計画の内容",null,null,null,null,"　分譲住宅（１５宅地）の宅地造成"]
[]
[null,null,null,null,null,null,"住　所",null,null,null,null,null,null,null,null,null,null,null,null,null,null,null,null,null,null,"住　所"]
[null,"事業主又は建築主等の住所・氏名",null,null,null,null,null,null,null,null,null,null,null,null,null,null,null,null,null,null,"事業主又は建築主等の住所・氏名",null,null,null,null,null,null,"○○○○住宅建設株式会社"]
[null,null,null,null,null,null,"氏　名",null,null,null,null,null,null,null,null,null,null,null,null,null,null,null,null,null,null,"氏　名",null,"代表取締役　　○○　○○"]
[]
[null,null,null,null,null,null,"住　所",null,null,null,null,null,null,null,null,null,null,null,null,null,null,null,null,null,null,"住　所"]
[null,null,null,null,null,null,null,null,null,null,null,null,null,null,null,null,null,null,null,null,null,null,null,null,null,null,null,"○○市○○町１－１－１"]
[null,"代理人等の住所・氏名・連絡先",null,null,null,null,"氏　名",null,null,null,null,null,null,null,null,null,null,null,null,null,"代理人等の住所・氏名・連絡先",null,null,null,null,"氏　名",null,"○○○設計事務所株式会社"]
[]
[null,null,null,null,null,null,"連絡先",null,null,null,null,"担当者名",null,null,null,null,null,null,null,null,null,null,null,null,null,"連絡先","XXX","（XXX","）XXXX",null,"担当者名　○○"]

{"sheet":"コントロールシート（貯留＋浸透）","index":5,"n_rows":25,"n_cols":13,"rows_kept":25,"cut":false,"hidden":false,"merged":[[12,2,12,3],[5,2,6,3],[13,2,13,3],[19,2,19,3],[21,2,21,3],[14,2,14,3],[15,2,15,3],[1,2,1,3],[1,5,1,7],[1,9,1,12],[0,2,0,3],[0,5,0,7],[5,5,6,7],[12,5,12,7],[0,9,0,12],[5,9,6,12],[8,9,8,10],[12,9,12,12],[3,9,3,12],[10,9,10,10],[24,2,26,3],[20,2,20,3],[2,9,2,12],[16,2,16,3],[17,2,17,3],[18,2,18,3],[2,5,2,6],[7,5,7,7],[13,5,13,7],[3,2,3,3],[2,2,2,3],[4,2,4,3],[4,5,4,7],[24,5,26,7],[16,5,19,7],[24,9,26,12],[17,9,17,10],[14,9,14,10],[15,9,15,10],[16,9,16,10],[11,9,11,12],[13,9,13,12]]}
[null,null,"浸透施設の計算",null,null,"浸透施設を見込んだ貯留容量",null,null,null,"ポンプ排水方式による調節計算"]
[null,null,"事前に入力しておくシート",null,null,"事前に入力しておくシート",null,null,null,"事前に入力しておくシート"]
[null,null,"施設諸元（浸透）",null,null,"施設諸元（浸透）",null,null,null,"施設諸元（ポンプ）"]
[null,null,"施設諸元（浸透_道路管理者用）",null,null,"施設諸元（浸透_道路管理者用）",null,null,null,"※ポンプ性能は「m3/s」で記載すること"]
[null,null,"その他、事前相談チェックシートに必要な項目",null,null,"その他、事前相談チェックシートに必要な項目"]
[null,null,"浸透施設に該当する項目にチェックを入れてください",null,null,"事前相談チェックシートで計算した必要対策量",null,null,null,"調整池諸元を記入する際の参考値"]
[]
[null,null,1,"浸透施設なし",null,"必要対策量（貯留量換算）",null,null,null,"浸透を考慮した必要な貯留施設容量",null,{"$f":"G15","v":0},"m3"]
[null,null,null,"浸透施設あり\n※施設諸元(浸透)に入力した場合",null,"法",{"$f":"事前相談チェックシート!R16","v":"不要"},"m3",null,"調整池の最大水深\n※オリフィス底部から設計水位\nまでの水深",null,{"$f":"事前相談チェックシート!R9","v":0},"m"]
[null,null,null,"浸透施設あり\n※施設諸元（浸透_道路管理者用）に入力した場合",null,"総合治水対策で\n必要な対策量(1.0ha以上)",{"$f":"事前相談チェックシート!V22","v":"不要"},"m3",null,"オリフィス径",null,{"$f":"事前相談チェックシート!V25","v":99999},"m"]
[null,null,null,null,null,"総合治水対策で\n必要な対策量(1.0ha未満)",{"$f":"事前相談チェックシート!V12","v":"不要"},"m3",null,"　　(オリフィス断面積)",null,{"$f":"PI()*(L10/2)^2","v":7853824555.1272011},"m2"]
[null,null,null,null,null,null,{"$f":"IF(MAX(G9:G11)=G9,1,IF(MAX(G9:G11)=G10,2,3))","v":3},null,null,"※上記数値は事前相談チェックシート記載の数値です"]
[null,null,"計算結果",null,null,"計算結果",null,null,null,"計算結果"]
[null,null,"上のチェックを入れ、「浸透施設の計算」ボタンを押してください",null,null,"上記、事前相談チェックシートで計算した必要対策量を確認の上「浸透施設を見込んだ貯留容量の算定」ボタンを押してください",null,null,null,"上記シートの入力が完了したら「ポンプ排水による\n調節計算」ボタンを押してください"]
[null,null,"Q1:許容放流量(m3/s)",null,null,"必要貯留施設容量",null,"m3",null,"設定したポンプ性能（最大）",null,{"$f":"MAX('施設諸元（ポンプ）'!F7:F56)","v":0},"m3/s"]
[null,null,{"$f":"事前相談チェックシート!U25","v":99999},null,null,null,null,null,null,"設定した貯留施設容量",null,{"$f":"MAX('施設諸元（ポンプ）'!C7:C56)","v":0},"m3"]
[null,null,"Q2:行為後ピーク流入量（浸透考慮前）(m3/s)",null,null,"施設諸元(浸透)又は\n施設諸元(浸透_道路管理者用)に\n入力した浸透施設と\n上記貯留施設が必要となります。",null,null,null,"許容放流量",null,{"$f":"事前相談チェックシート!U25","v":99999},"m3/s"]
[null,null,{"$f":"浸透計算!B2","v":0.43075000000000002},null,null,null,null,null,null,"ピーク時のオリフィス放流量（計算値）",null,{"$f":"MAX('調節計算（ポンプ）'!E7:E151)","v":9.5699999999999993E-2},"m3/s"]
[null,null,"Q3:行為後ピーク流入量（浸透考慮後）(m3/s)"]
[null,null,{"$f":"浸透計算!C2","v":0.43075000000000002},null,null,null,null,null,null,"貯留量の判定",null,{"$f":"IF(L16>=L8,\"O.K.\",\"N.G.\")","v":"O.K."}]
[null,null,"Q3≦Q1の場合、浸透施設のみで処理可能",null,null,null,null,null,null,"ピーク放流量の判定",null,{"$f":"IF(L18<=L17,\"O.K.\",\"N.G\")","v":"O.K."}]
[]
[]
[]
[null,null,"※浸透施設を見込まない場合も、「浸透施設なし」にチェックの上、「浸透施設の計算」を実施してください",null,null,"※「①浸透施設の計算」実施後に押してください",null,null,null,"※貯留量の判定が「N.G.」となった場合には貯留施設を大きく、ピーク放流量の判定は「N.G」となった場合にはポンプ排水量を小さくしてください\n※浸透施設の見直しを行った場合は「①浸透施設の計算」からやり直してください（見直しを行わなかった場合には不要です）"]

{"sheet":"ピーク流量算定表","index":6,"n_rows":46,"n_cols":13,"rows_kept":46,"cut":false,"hidden":false,"merged":[[3,4,3,5],[4,4,4,5],[5,11,6,12]]}
[]
["使用降雨強度及び行為前後のピーク流入量"]
[]
["ピーク流入量（行為前）",null,null,null,{"$f":"事前相談チェックシート!R11","v":{"$error":"#DIV/0!"}},null,"m3／s"]
["ピーク流入量（行為後）",null,null,null,{"$f":"事前相談チェックシート!R13","v":{"$error":"#DIV/0!"}},null,"m3／s"]
[null,null,null,null,null,null,null,null,null,null,null,{"$f":"事前相談チェックシート!U4","v":0}]
[]
["降雨強度の推移表"]
[]
[null,"時","分","降雨量\n（mm/h）","時","分","降雨量\n（mm/h）","時","分","降雨量\n（mm/h）","時","分","降雨量\n（mm/h）"]
[null,0,"0－10",{"$f":"mkrain!G4","v":2.7},6,"0－10",{"$f":"mkrain!G40","v":4.3},12,"0－10",{"$f":"mkrain!G76","v":61.1},18,"0－10",{"$f":"mkrain!G112","v":4.2}]
[null,null,"10－20",{"$f":"mkrain!G5","v":2.7},null,"10－20",{"$f":"mkrain!G41","v":4.4000000000000004},null,"10－20",{"$f":"mkrain!G77","v":34.700000000000003},null,"10－20",{"$f":"mkrain!G113","v":4.0999999999999996}]
[null,null,"20－30",{"$f":"mkrain!G6","v":2.7},null,"20－30",{"$f":"mkrain!G42","v":4.5},null,"20－30",{"$f":"mkrain!G78","v":25.4},null,"20－30",{"$f":"mkrain!G114","v":4}]
[null,null,"30－40",{"$f":"mkrain!G7","v":2.7},null,"30－40",{"$f":"mkrain!G43","v":4.5999999999999996},null,"30－40",{"$f":"mkrain!G79","v":20.5},null,"30－40",{"$f":"mkrain!G115","v":4}]
[null,null,"40－50",{"$f":"mkrain!G8","v":2.8},null,"40－50",{"$f":"mkrain!G44","v":4.7},null,"40－50",{"$f":"mkrain!G80","v":17.399999999999999},null,"40－50",{"$f":"mkrain!G116","v":3.9}]
[null,null,"50－60",{"$f":"mkrain!G9","v":2.8},null,"50－60",{"$f":"mkrain!G45","v":4.8},null,"50－60",{"$f":"mkrain!G81","v":15.2},null,"50－60",{"$f":"mkrain!G117","v":3.8}]
[null,1,"0－10",{"$f":"mkrain!G10","v":2.8},7,"0－10",{"$f":"mkrain!G46","v":4.9000000000000004},13,"0－10",{"$f":"mkrain!G82","v":13.6},19,"0－10",{"$f":"mkrain!G118","v":3.8}]
[null,null,"10－20",{"$f":"mkrain!G11","v":2.9},null,"10－20",{"$f":"mkrain!G47","v":5},null,"10－20",{"$f":"mkrain!G83","v":12.3},null,"10－20",{"$f":"mkrain!G119","v":3.7}]
[null,null,"20－30",{"$f":"mkrain!G12","v":2.9},null,"20－30",{"$f":"mkrain!G48","v":5.0999999999999996},null,"20－30",{"$f":"mkrain!G84","v":11.3},null,"20－30",{"$f":"mkrain!G120","v":3.7}]
[null,null,"30－40",{"$f":"mkrain!G13","v":2.9},null,"30－40",{"$f":"mkrain!G49","v":5.3},null,"30－40",{"$f":"mkrain!G85","v":10.5},null,"30－40",{"$f":"mkrain!G121","v":3.6}]
[null,null,"40－50",{"$f":"mkrain!G14","v":2.9},null,"40－50",{"$f":"mkrain!G50","v":5.4},null,"40－50",{"$f":"mkrain!G86","v":9.8000000000000007},null,"40－50",{"$f":"mkrain!G122","v":3.5}]
[null,null,"50－60",{"$f":"mkrain!G15","v":3},null,"50－60",{"$f":"mkrain!G51","v":5.6},null,"50－60",{"$f":"mkrain!G87","v":9.1999999999999993},null,"50－60",{"$f":"mkrain!G123","v":3.5}]
[null,2,"0－10",{"$f":"mkrain!G16","v":3},8,"0－10",{"$f":"mkrain!G52","v":5.7},14,"0－10",{"$f":"mkrain!G88","v":8.6999999999999993},20,"0－10",{"$f":"mkrain!G124","v":3.4}]
[null,null,"10－20",{"$f":"mkrain!G17","v":3},null,"10－20",{"$f":"mkrain!G53","v":5.9},null,"10－20",{"$f":"mkrain!G89","v":8.1999999999999993},null,"10－20",{"$f":"mkrain!G125","v":3.4}]
[null,null,"20－30",{"$f":"mkrain!G18","v":3.1},null,"20－30",{"$f":"mkrain!G54","v":6.1},null,"20－30",{"$f":"mkrain!G90","v":7.9},null,"20－30",{"$f":"mkrain!G126","v":3.3}]
[null,null,"30－40",{"$f":"mkrain!G19","v":3.1},null,"30－40",{"$f":"mkrain!G55","v":6.3},null,"30－40",{"$f":"mkrain!G91","v":7.5},null,"30－40",{"$f":"mkrain!G127","v":3.3}]
[null,null,"40－50",{"$f":"mkrain!G20","v":3.2},null,"40－50",{"$f":"mkrain!G56","v":6.5},null,"40－50",{"$f":"mkrain!G92","v":7.2},null,"40－50",{"$f":"mkrain!G128","v":3.3}]
[null,null,"50－60",{"$f":"mkrain!G21","v":3.2},null,"50－60",{"$f":"mkrain!G57","v":6.8},null,"50－60",{"$f":"mkrain!G93","v":6.9},null,"50－60",{"$f":"mkrain!G129","v":3.2}]
[null,3,"0－10",{"$f":"mkrain!G22","v":3.2},9,"0－10",{"$f":"mkrain!G58","v":7},15,"0－10",{"$f":"mkrain!G94","v":6.6},21,"0－10",{"$f":"mkrain!G130","v":3.2}]
[null,null,"10－20",{"$f":"mkrain!G23","v":3.3},null,"10－20",{"$f":"mkrain!G59","v":7.3},null,"10－20",{"$f":"mkrain!G95","v":6.4},null,"10－20",{"$f":"mkrain!G131","v":3.1}]
[null,null,"20－30",{"$f":"mkrain!G24","v":3.3},null,"20－30",{"$f":"mkrain!G60","v":7.7},null,"20－30",{"$f":"mkrain!G96","v":6.2},null,"20－30",{"$f":"mkrain!G132","v":3.1}]
[null,null,"30－40",{"$f":"mkrain!G25","v":3.4},null,"30－40",{"$f":"mkrain!G61","v":8},null,"30－40",{"$f":"mkrain!G97","v":6},null,"30－40",{"$f":"mkrain!G133","v":3.1}]
[null,null,"40－50",{"$f":"mkrain!G26","v":3.4},null,"40－50",{"$f":"mkrain!G62","v":8.5},null,"40－50",{"$f":"mkrain!G98","v":5.8},null,"40－50",{"$f":"mkrain!G134","v":3}]
[null,null,"50－60",{"$f":"mkrain!G27","v":3.5},null,"50－60",{"$f":"mkrain!G63","v":8.9},null,"50－60",{"$f":"mkrain!G99","v":5.6},null,"50－60",{"$f":"mkrain!G135","v":3}]
[null,4,"0－10",{"$f":"mkrain!G28","v":3.5},10,"0－10",{"$f":"mkrain!G64","v":9.5},16,"0－10",{"$f":"mkrain!G100","v":5.5},22,"0－10",{"$f":"mkrain!G136","v":3}]
[null,null,"10－20",{"$f":"mkrain!G29","v":3.6},null,"10－20",{"$f":"mkrain!G65","v":10.1},null,"10－20",{"$f":"mkrain!G101","v":5.3},null,"10－20",{"$f":"mkrain!G137","v":2.9}]
[null,null,"20－30",{"$f":"mkrain!G30","v":3.6},null,"20－30",{"$f":"mkrain!G66","v":10.9},null,"20－30",{"$f":"mkrain!G102","v":5.2},null,"20－30",{"$f":"mkrain!G138","v":2.9}]
[null,null,"30－40",{"$f":"mkrain!G31","v":3.7},null,"30－40",{"$f":"mkrain!G67","v":11.8},null,"30－40",{"$f":"mkrain!G103","v":5.0999999999999996},null,"30－40",{"$f":"mkrain!G139","v":2.9}]
[null,null,"40－50",{"$f":"mkrain!G32","v":3.7},null,"40－50",{"$f":"mkrain!G68","v":12.9},null,"40－50",{"$f":"mkrain!G104","v":4.9000000000000004},null,"40－50",{"$f":"mkrain!G140","v":2.8}]
[null,null,"50－60",{"$f":"mkrain!G33","v":3.8},null,"50－60",{"$f":"mkrain!G69","v":14.3},null,"50－60",{"$f":"mkrain!G105","v":4.8},null,"50－60",{"$f":"mkrain!G141","v":2.8}]
[null,5,"0－10",{"$f":"mkrain!G34","v":3.9},11,"0－10",{"$f":"mkrain!G70","v":16.2},17,"0－10",{"$f":"mkrain!G106","v":4.7},23,"0－10",{"$f":"mkrain!G142","v":2.8}]
[null,null,"10－20",{"$f":"mkrain!G35","v":3.9},null,"10－20",{"$f":"mkrain!G71","v":18.8},null,"10－20",{"$f":"mkrain!G107","v":4.5999999999999996},null,"10－20",{"$f":"mkrain!G143","v":2.7}]
[null,null,"20－30",{"$f":"mkrain!G36","v":4},null,"20－30",{"$f":"mkrain!G72","v":22.6},null,"20－30",{"$f":"mkrain!G108","v":4.5},null,"20－30",{"$f":"mkrain!G144","v":2.7}]
[null,null,"30－40",{"$f":"mkrain!G37","v":4.0999999999999996},null,"30－40",{"$f":"mkrain!G73","v":29.2},null,"30－40",{"$f":"mkrain!G109","v":4.4000000000000004},null,"30－40",{"$f":"mkrain!G145","v":2.7}]
[null,null,"40－50",{"$f":"mkrain!G38","v":4.0999999999999996},null,"40－50",{"$f":"mkrain!G74","v":43.6},null,"40－50",{"$f":"mkrain!G110","v":4.3},null,"40－50",{"$f":"mkrain!G146","v":2.7}]
[null,null,"50－60",{"$f":"mkrain!G39","v":4.2},null,"50－60",{"$f":"mkrain!G75","v":127},null,"50－60",{"$f":"mkrain!G111","v":4.3},null,"50－60",{"$f":"mkrain!G147","v":2.6}]

{"sheet":"施設諸元（ポンプ）","index":7,"n_rows":6,"n_cols":6,"rows_kept":6,"cut":false,"hidden":false,"merged":[[2,1,2,5]]}
[null,null,null,null,null,"【提出様式】"]
["流出抑制施設諸元(ポンプ排水)"]
[null,"調整池水深（H）に対する貯留施設容量（V)、ポンプ容量（Q)を記入\n（※流出抑制施設の配置位置（平面図）、構造諸元のわかる図面を添付すること）"]
[]
[null,"調整池諸元",null,null,"ポンプ諸元"]
[null,"Ｈ(m)","Ｖ(m3)",null,"Ｈ(m)","Q(m3/s)"]

{"sheet":"比浸透量","index":8,"n_rows":35,"n_cols":31,"rows_kept":35,"cut":false,"hidden":false,"merged":[[1,0,1,3],[1,10,1,11],[29,1,29,2],[30,1,30,2],[31,1,33,1],[24,10,24,11],[24,1,24,2],[24,5,24,6],[24,7,24,8],[26,1,26,2],[27,1,27,2],[28,1,28,2]]}
[9,null,null,null,null,null,null,null,null,null,null,null,null,null,null,null,null,null,null,null,null,null,null,null,null,null,null,null,null,null,1]
["比浸透量計算書",null,null,null,null,null,null,null,null,null,"【提出様式】"]
[null,null,null,null,null,null,null,null,null,null,null,null,null,null,"大型貯留槽"]
[null,null,"透水性舗装",null,null,null,null,null,null,null,null,null,null,null,"側面及び底面"]
[null,null,"浸透側溝および浸透トレンチ",null,null,null,null,null,null,null,null,null,null,null,"W","H","L","a1","a2","b","X","a","b","K"]
[null,null,"円筒ます（側面および底面）",null,null,null,null,null,null,null,null,null,null,1,5,{"$f":"D$14","v":1},{"$f":"D$17","v":30},8.83,-0.46100000000000002,7.03,{"$f":"D$17/D$15","v":30},{"$f":"R6*U6^S6","v":1.8408050841688621},{"$f":"T6","v":7.03},{"$f":"(V6*P6+W6)*Q6","v":266.12415252506588}]
[null,null,"円筒ます（底面）",null,null,null,null,null,null,null,null,null,null,2,10,{"$f":"D$14","v":1},{"$f":"D$17","v":30},7.88,-0.44600000000000001,14,{"$f":"D$17/D$15","v":30},{"$f":"R7*U7^S7","v":1.7287418189721226},{"$f":"T7","v":14},{"$f":"(V7*P7+W7)*Q7","v":471.86225456916372}]
[null,null,"正方形ます（側面および底面）",null,null,null,null,null,null,null,null,null,null,3,20,1,30,7.06,-0.45200000000000001,27.06,30,1.5175600805960701,27.06,857.32680241788205]
[null,null,"正方形ます（底面）",null,null,null,null,null,null,null,null,null,null,4,30,1,30,6.43,-0.44400000000000001,39.75,30,1.4202641860056644,39.75,1235.1079255801701]
[null,null,"矩形の桝",null,null,null,null,null,null,null,null,null,null,5,40,1,30,5.97,-0.44,52.25,30,1.3367216406502462,52.25,1607.6016492195074]
[null,null,"大型貯留浸透槽（側面及び底面）",null,null,null,null,null,null,null,null,null,null,6,50,1,30,5.62,-0.442,64.680000000000007,30,1.2498235998188771,64.680000000000007,1977.8947079945667]
[null,null,"大型貯留浸透槽（底面）",null,null,null,null,null,null,null,null,null,null,7,{"$f":"D15","v":1},{"$f":"D$14","v":1},{"$f":"D$17","v":30},{"$f":"R11","v":5.62},{"$f":"S11","v":-0.442},{"$f":"T11","v":64.680000000000007},{"$f":"D$17/D$15","v":30},{"$f":"R12*U12^S12","v":1.2498235998188771},64.680000000000007,{"$f":"(V12*P12+W12)*Q12","v":1977.8947079945667}]
[null,null,null,null,null,null,null,null,null,null,null,null,null,null,"上ランク","下ランク"]
[null,null,"H：設計水頭(m)",1,null,null,null,null,null,null,null,null,null,null,{"$f":"IF(D15<=O6,1,IF(D15<=O7,2,IF(D15<=O8,3,IF(D15<=O9,4,IF(D15<=O10,5,IF(D15<=O11,6,7))))))","v":1},{"$f":"IF(D15>=O11,7,IF(O14=1,1,O14-1))","v":1},null,"内挿パラ↓"]
[null,null,"W：施設幅(m)",1,null,null,null,null,null,null,null,null,null,"W",{"$f":"VLOOKUP(O14,$N$6:$O$12,2,FALSE)","v":5},{"$f":"VLOOKUP(P14,$N$6:$O$12,2,FALSE)","v":5},{"$f":"D15","v":1},{"$f":"IF(O14=P14,0,(Q15-P15)/(O15-P15))","v":0}]
[null,null,"D：施設直径(m)",5,null,null,null,null,null,null,null,null,null,"K",{"$f":"VLOOKUP(O14,$N$6:$X$12,11,FALSE)","v":266.12415252506588},{"$f":"VLOOKUP(P14,$N$6:$X$12,11,FALSE)","v":266.12415252506588},{"$f":"(O16-P16)*R15+P16","v":266.12415252506588}]
[null,null,"L：施設延長(m)",30]
[]
[null,null,"K：比浸透量",246.17336031445828]
[null,null,null,null,null,null,null,null,null,null,null,null,null,null,"大型貯留槽"]
[null,null,null,null,null,null,null,null,null,null,null,null,null,null,"底面"]
[null,null,null,null,null,null,null,null,null,null,null,null,null,null,"W","H","L","a1","a2","b","X","a","b","K"]
[null,null,null,null,null,null,null,null,null,null,null,null,null,1,5,{"$f":"D$14","v":1},{"$f":"D$17","v":30},1.94,-0.32800000000000001,7.57,{"$f":"D$17/D$15","v":30},{"$f":"R23*U23^S23","v":0.63577867714860958},{"$f":"T23","v":7.57},{"$f":"(V23*P23+W23)*Q23","v":246.17336031445828}]
[null,null,null,null,null,null,null,null,null,null,null,null,null,2,10,{"$f":"D$14","v":1},{"$f":"D$17","v":30},2.29,-0.39700000000000002,13.84,{"$f":"D$17/D$15","v":30},{"$f":"R24*U24^S24","v":0.59349674880325565},{"$f":"T24","v":13.84},{"$f":"(V24*P24+W24)*Q24","v":433.00490246409765}]
[null,"施設",null,"透水性舗装\n（浸透池）","浸透側溝\nおよび\n浸透トレンチ","円筒ます",null,"正方形ます",null,"矩形\nのます","大型貯留槽",null,null,3,20,1,30,2.37,-0.48799999999999999,26.36,30,0.45072658405316113,26.36,804.32179752159482]
[null,"浸透面",null,"底面","側面\nおよび\n底面","側面\nおよび\n底面","底面","側面\nおよび\n底面","底面","側面\nおよび\n底面","側面\n及び\n底面","底面",null,4,30,1,30,2.17,-0.51800000000000002,38.79,30,0.3726584076399827,38.79,1174.8797522291993]
[null,"模式図",null,null,null,null,null,null,null,null,null,null,null,5,40,1,30,1.96,-0.55400000000000005,51.16,30,0.29780425336894595,51.16,1543.7341276010682]
[null,"H：設計水頭（m）",1,{"$f":"$D14","v":1},{"$f":"$D14","v":1},{"$f":"$D14","v":1},{"$f":"$D14","v":1},{"$f":"$D14","v":1},1,1,1,1,null,6,50,1,30,1.76,-0.60899999999999999,63.5,30,0.22179197268950421,63.5,1911.653759180685]
[null,"W：施設幅(m)",null,{"$f":"$D15","v":1},{"$f":"$D15","v":1},{"$f":"$D15","v":1},1,1,1,1,1,1,null,7,{"$f":"D15","v":1},1,30,{"$f":"R28","v":1.76},{"$f":"S28","v":-0.60899999999999999},{"$f":"T28","v":63.5},30,0.22179197268950421,63.5,1911.653759180685]
[null,"D：施設直径",null,{"$f":"$D16","v":5},5,5,5,5,5,5,5,5,null,null,"上ランク","下ランク"]
[null,"L：施設延長(m)",null,{"$f":"$D17","v":30},{"$f":"$D17","v":30},30,30,30,30,30,30,30,null,null,{"$f":"IF(D15<=O23,1,IF(D15<=O24,2,IF(D15<=O25,3,IF(D15<=O26,4,IF(D15<=O27,5,IF(D15<=O28,6,7))))))","v":1},{"$f":"IF(D32>=O28,7,IF(O31=1,1,O31-1))","v":1},null,"内挿パラ↓"]
[null,"係数","a",1.4E-2,3.093,{"$f":"IF(F30<0.2,\"適用外\",IF(F30<=1,0.475*F30+0.945,IF(F30<=10,6.244*F30+2.853,\"適用外\")))","v":34.073},{"$f":"IF(G30<0.3,\"適用外\",IF(G30<=1,1.497*G30-0.1,IF(G30<=10,2.556*G30-2.052,\"適用外\")))","v":10.728000000000002},{"$f":"IF(H29<=1,0.12*H29+0.985,IF(H29<=10,-0.453*H29^2+8.289*H29+0.753,IF(H29<=80,0.747*H29+21.355,\"適用外\")))","v":1.105},{"$f":"IF(I29<=1,1.676*I29-0.137,IF(I29<=10,-0.204*I29^2+3.166*I29-1.936,IF(I29<=80,1.265*I29-15.67,\"適用外\")))","v":1.5389999999999999},{"$f":"3.297*J31+1.971*J29+4.663","v":105.54400000000001},"別途算定","別途算定",null,"W",{"$f":"VLOOKUP(O31,$N$23:$O$29,2,FALSE)","v":5},{"$f":"VLOOKUP(P31,$N$23:$O$29,2,FALSE)","v":5},{"$f":"D15","v":1},{"$f":"IF(O31=P31,0,(Q32-P32)/(O32-P32))","v":0}]
[null,null,"b",1.2869999999999999,{"$f":"1.34*E29+0.677","v":2.0170000000000003},{"$f":"IF(F30<0.2,\"適用外\",IF(F30<=1,6.07*F30+1.01,IF(F30<=10,0.93*F30^2+1.606*F30-0.773,\"適用外\")))","v":30.507000000000001},{"$f":"IF(G30<0.3,\"適用外\",IF(G30<=1,1.13*G30^2+0.638*G30-0.011,IF(G30<=10,0.924*G30^2+0.993*G30-0.087,\"適用外\")))","v":27.978000000000002},{"$f":"IF(H29<=1,7.837*H29+0.82,IF(H29<=10,1.458*H29^2+1.27*H29+0.362,IF(H29<=80,1.263*H29^2+4.295*H29-7.649,\"適用外\")))","v":8.657},{"$f":"IF(I29<=1,1.496*I29^2+I29*0.671-0.015,IF(I29<=10,1.345*I29^2+0.736*I29+0.251,IF(I29<=80,1.259*I29^2+2.336*I29-8.13,\"適用外\")))","v":2.1519999999999997},{"$f":"(1.401*J29+0.684)*J31+1.214*J29-0.834","v":62.929999999999993},"別途算定","別途算定",null,"K",{"$f":"VLOOKUP(O31,$N$23:$X$29,11,FALSE)","v":246.17336031445828},{"$f":"VLOOKUP(P31,$N$23:$X$29,11,FALSE)","v":246.17336031445828},{"$f":"(O33-P33)*R32+P33","v":246.17336031445828}]
[null,null,"c","-","-",{"$f":"IF(F30<0.2,\"適用外\",IF(F30<=1,2.57*F30-0.188,IF(F30<=10,\"-\",\"適用外\")))","v":"-"},{"$f":"IF(G29<=1,2.858*G29-0.283,IF(G29<80,\"-\",\"適用外\"))","v":2.5750000000000002},{"$f":"IF(H29<=1,2.858*H29-0.283,IF(H29<=80,\"-\",\"適用外\"))","v":2.5750000000000002},"-","-","-","-"]
[null,"比浸透量","K",{"$f":"IF(D28<=1.5,D32*D28+D33,\"適用外\")","v":1.3009999999999999},{"$f":"IF(AND(E28<=1.5,E29<=1.5),E32*E28+E33,\"適用外\")","v":5.1100000000000003},{"$f":"IF(F28<=5,IF(F30<0.2,\"適用外\",IF(F30<=1,F32*F28^2+F33*F28+F34,IF(F30<=10,F32*F28+F33,\"適用外\"))),\"適用外\")","v":64.58},{"$f":"IF(G28<=5,IF(G30<0.3,\"適用外\",IF(G30<10,G32*G30+G33,\"適用外\")),\"適用外\")","v":81.618000000000009},{"$f":"IF(H28<=5,IF(H29<=1,H32*H28^2+H33*H28+H34,IF(H29<=80,H32*H28+H33,\"適用外\")),\"適用外\")","v":12.337},{"$f":"IF(AND(I29<=80,I28<=5),I32*I28+I33,\"適用外\")","v":3.6909999999999998},{"$f":"IF(AND(J28<=5,J29<=5,J31<=200),J32*J28+J33,\"適用外\")","v":168.47399999999999},{"$f":"IF(OR(K28<0.5,K28>5),\"適用外\",Q16)","v":266.12415252506588},{"$f":"IF(OR(L28<0.5,L28>5),\"適用外\",Q33)","v":246.17336031445828}]

{"sheet":"施設諸元（浸透）","index":9,"n_rows":60,"n_cols":21,"rows_kept":60,"cut":false,"hidden":false,"merged":[[47,15,49,15],[48,2,49,2],[48,3,49,3],[34,3,35,3],[47,1,49,1],[47,2,47,3],[47,4,49,4],[47,5,47,7],[47,13,49,13],[34,2,35,2],[33,1,35,1],[33,2,33,3],[33,4,35,4],[47,14,49,14],[5,5,5,7],[5,13,7,13],[33,5,33,7],[33,13,35,13],[19,15,19,16],[5,15,5,16],[20,15,21,15],[20,16,21,16],[20,14,21,14],[33,14,35,14],[33,15,35,15],[6,14,7,14],[6,15,7,15],[6,16,7,16],[19,1,21,1],[19,2,19,3],[19,4,21,4],[19,5,19,7],[19,13,21,13],[20,2,21,2],[20,3,21,3],[5,1,7,1],[5,2,5,3],[5,4,7,4],[6,2,7,2],[6,3,7,3]]}
[null,null,null,null,null,null,null,null,null,null,null,null,null,null,null,null,"【提出様式】",null,null,null,{"$f":"MAX(D9:D18,D23:D32,D37:D46,D51:D60)","v":0}]
["流出抑制施設諸元（浸透施設）"]
[null,"浸透施設諸元",null,null,null,null,null,null,null,null,null,null,null,"空隙貯留量諸元"]
[null,"浸透能力",{"$f":"SUM(J9:J60)/3600","v":0},"m3/s",null,null,null,null,null,null,null,null,null,"空隙貯留量",{"$f":"SUM(K9:K60)","v":0},"m3"]
[]
[null,"【浸透ます】","単位設計浸透能",null,"設置数量\n（個）","影響係数",null,null,null,null,null,null,null,"【浸透ます】\n1個あたり","ます部","砕石部"]
[null,null,"比浸透量（㎡）","飽和透水係数\n（m/hr）",null,"（1）","（2）","（3）",null,null,null,null,null,null,"体積\n（ｍ3）","体積\n（ｍ3）","空隙率\n（％）"]
[null,null,null,null,null,"内容（１）","内容（２）","内容（３）"]
[null,1,null,0,null,0.9,0.9,1,{"$f":"D9","v":0},{"$f":"$C9*$I9*$E9*$F9*$G9*$H9","v":0},{"$f":"($O9+$P9*$Q9/100)*$E9","v":0},null,null,1]
[null,2,null,0,null,0.9,0.9,1,{"$f":"D10","v":0},{"$f":"$C10*$I10*$E10*$F10*$G10*$H10","v":0},{"$f":"($O10+$P10*$Q10/100)*$E10","v":0},null,null,2]
[null,3,null,0,null,0.9,0.9,1,0,0,0,null,null,3]
[null,4,null,0,null,0.9,0.9,1,0,0,0,null,null,4]
[null,5,null,0,null,0.9,0.9,1,0,0,0,null,null,5]
[null,6,null,0,null,0.9,0.9,1,0,0,0,null,null,6]
[null,7,null,0,null,0.9,0.9,1,0,0,0,null,null,7]
[null,8,null,0,null,0.9,0.9,1,0,0,0,null,null,8]
[null,9,null,0,null,0.9,0.9,1,0,0,0,null,null,9]
[null,10,null,0,null,0.9,0.9,1,0,0,0,null,null,10]
[]
[null,"【浸透トレンチ】","単位設計浸透能",null,"設置数量\n（ｍ）","影響係数",null,null,null,null,null,null,null,"【浸透トレンチ】\n1mあたり","浸透管部","砕石部"]
[null,null,"比浸透量（㎡）","飽和透水係数\n（m/hr）",null,"（1）","（2）","（3）",null,null,null,null,null,null,"体積\n（ｍ3）","体積\n（ｍ3）","空隙率\n（％）"]
[null,null,null,null,null,"内容（１）","内容（２）","内容（３）"]
[null,1,null,0,null,0.9,0.9,1,{"$f":"D23","v":0},{"$f":"$C23*$I23*$E23*$F23*$G23*$H23","v":0},{"$f":"($O23+$P23*$Q23/100)*$E23","v":0},null,null,1]
[null,2,null,0,null,0.9,0.9,1,0,{"$f":"$C24*$I24*$E24*$F24*$G24*$H24","v":0},0,null,null,2]
[null,3,null,0,null,0.9,0.9,1,0,0,0,null,null,3]
[null,4,null,0,null,0.9,0.9,1,0,0,0,null,null,4]
[null,5,null,0,null,0.9,0.9,1,0,0,0,null,null,5]
[null,6,null,0,null,0.9,0.9,1,0,0,0,null,null,6]
[null,7,null,0,null,0.9,0.9,1,0,0,0,null,null,7]
[null,8,null,0,null,0.9,0.9,1,0,0,0,null,null,8]
[null,9,null,0,null,0.9,0.9,1,0,0,0,null,null,9]
[null,10,null,0,null,0.9,0.9,1,0,0,0,null,null,10]
[]
[null,"【透水性舗装】","単位設計浸透能",null,"設置数量\n（㎡）","影響係数",null,null,null,null,null,null,null,"【透水性舗装】\n1㎡あたり","体積\n（ｍ3）","空隙率\n（％）"]
[null,null,"比浸透量（㎡）","飽和透水係数\n（m/hr）",null,"（1）","（2）","（3）"]
[null,null,null,null,null,"内容（１）","内容（２）","内容（３）"]
[null,1,null,0,null,0.9,0.9,1,{"$f":"D37","v":0},{"$f":"$C37*$I37*$E37*$F37*$G37*$H37","v":0},{"$f":"$E37*($P37/100*O37)","v":0},null,null,1]
[null,2,null,0,null,0.9,0.9,1,0,{"$f":"$C38*$I38*$E38*$F38*$G38*$H38","v":0},{"$f":"$E38*($P38/100*O38)","v":0},null,null,2]
[null,3,null,0,null,0.9,0.9,1,0,0,0,null,null,3]
[null,4,null,0,null,0.9,0.9,1,0,0,0,null,null,4]
[null,5,null,0,null,0.9,0.9,1,0,0,0,null,null,5]
[null,6,null,0,null,0.9,0.9,1,0,0,0,null,null,6]
[null,7,null,0,null,0.9,0.9,1,0,0,0,null,null,7]
[null,8,null,0,null,0.9,0.9,1,0,0,0,null,null,8]
[null,9,null,0,null,0.9,0.9,1,0,0,0,null,null,9]
[null,10,null,0,null,0.9,0.9,1,0,0,0,null,null,10]
[]
[null,"【その他】","単位設計浸透能",null,"設置数量\n（単位）","影響係数",null,null,null,null,null,null,null,"【その他】","体積\n（ｍ3）","空隙率\n（％）"]
[null,null,"比浸透量（㎡）","飽和透水係数\n（m/hr）",null,"（1）","（2）","（3）"]
[null,null,null,null,null,"内容（１）","内容（２）","内容（３）"]
[null,1,null,0,null,0.9,0.9,1,{"$f":"D51","v":0},{"$f":"$C51*$I51*$E51*$F51*$G51*$H51","v":0},{"$f":"$E51*($P51/100*O51)","v":0},null,null,1]
[null,2,null,0,null,0.9,0.9,1,0,{"$f":"$C52*$I52*$E52*$F52*$G52*$H52","v":0},{"$f":"$E52*($P52/100*O52)","v":0},null,null,2]
[null,3,null,0,null,0.9,0.9,1,0,0,0,null,null,3]
[null,4,null,0,null,0.9,0.9,1,0,0,0,null,null,4]
[null,5,null,0,null,0.9,0.9,1,0,0,0,null,null,5]
[null,6,null,0,null,0.9,0.9,1,0,0,0,null,null,6]
[null,7,null,0,null,0.9,0.9,1,0,0,0,null,null,7]
[null,8,null,0,null,0.9,0.9,1,0,0,0,null,null,8]
[null,9,null,0,null,0.9,0.9,1,0,0,0,null,null,9]
[null,10,null,0,null,0.9,0.9,1,0,0,0,null,null,10]

{"sheet":"施設諸元（浸透_道路管理者用）","index":10,"n_rows":62,"n_cols":19,"rows_kept":62,"cut":false,"hidden":false,"merged":[[56,1,56,2],[56,6,56,7],[57,1,57,2],[58,1,58,2],[59,1,59,6],[48,1,48,2],[49,1,49,2],[50,1,50,2],[51,1,51,2],[52,1,52,2],[53,1,53,2],[42,12,43,12],[42,13,43,13],[44,1,44,2],[45,1,45,2],[46,1,46,2],[47,1,47,2],[41,5,43,5],[41,6,43,6],[41,7,41,8],[41,10,43,10],[41,12,41,13],[42,3,43,3],[42,4,43,4],[42,7,43,7],[42,8,43,8],[42,11,43,11],[36,1,36,2],[37,1,37,2],[38,1,38,2],[39,1,39,2],[41,1,43,2],[41,3,41,4],[35,1,35,2],[27,10,29,10],[27,12,27,13],[27,15,29,15],[27,16,29,16],[27,7,27,8],[28,7,29,7],[28,8,29,8],[30,1,30,2],[31,1,31,2],[32,1,32,2],[33,1,33,2],[34,1,34,2],[27,17,29,17],[27,18,29,18],[28,11,29,11],[28,12,29,12],[28,13,29,13],[25,1,25,6],[27,1,29,2],[27,3,27,4],[27,5,29,5],[27,6,29,6],[28,3,29,3],[28,4,29,4],[20,1,20,2],[20,9,20,10],[21,1,21,2],[21,9,21,10],[22,1,22,2],[22,9,22,10],[19,1,19,2],[19,9,19,10],[12,1,13,1],[12,6,12,7],[13,6,13,7],[14,1,14,6],[15,1,15,3],[16,1,16,2],[16,9,16,10],[17,1,17,2],[17,9,17,10],[18,1,18,2],[18,9,18,10],[10,1,11,1],[10,6,10,7],[11,6,11,7],[4,7,4,8],[6,1,6,6],[8,1,8,2],[9,1,9,2],[9,6,9,7]]}
[null,null,null,null,null,null,null,null,null,null,null,null,null,"【提出様式】"]
["流出抑制施設諸元（浸透施設_道路管理者用）"]
[]
[]
[]
["透水性舗装"]
[]
[null,"基本諸元"]
[null,"設置数量(舗装面積) (m2)"]
[null,"飽和透水係数 （m/hr）",null,null,null,null,"上層路盤での貯留率(%)",null,{"$f":"L21","v":0}]
[null,"比浸透量算定定数\nK=aH+b","a",null,null,null,"下層路盤での貯留率(%)",null,{"$f":"L22","v":0}]
[null,null,"b",null,null,null,"下層路盤厚(mm)",null,{"$f":"D22","v":0}]
[null,"目詰まり\n係数","C1",null,null,null,"下層路盤での貯留量(mm)",null,{"$f":"M22","v":0}]
[null,null,"C2",null,null,null,"貯留量の合計(mm)",null,{"$f":"M23","v":0}]
[]
[null,"貯留率と水拘束率"]
[null,null,null,"厚さ(mm)","空気間隙率\n(%)","空気間隙率との関係","水拘束率\n(%)","水拘束量\n(mm)","貯留率\n(%)","貯留量\n(mm)",null,"STEP2での\n貯留率\n(%)","STEP2での\n貯留量\n(mm)"]
[null,"関係式",null,"a","b","b'","c","a×c/100","d (=b+b')","a×d/100",null,"d-c","a×(d-c)/100"]
[null,"表層",null,null,null,null,null,{"$f":"D19*G19/100","v":0},{"$f":"E19+F19","v":0},{"$f":"D19*I19/100","v":0},null,{"$f":"I19-G19","v":0},{"$f":"D19*(I19-G19)/100","v":0}]
[null,"中間層・基層",null,null,null,null,null,{"$f":"D20*G20/100","v":0},{"$f":"E20+F20","v":0},{"$f":"D20*I20/100","v":0},null,{"$f":"I20-G20","v":0},{"$f":"D20*(I20-G20)/100","v":0}]
[null,"上層路盤",null,null,null,null,null,{"$f":"D21*G21/100","v":0},{"$f":"E21+F21","v":0},{"$f":"D21*I21/100","v":0},null,{"$f":"I21-G21","v":0},{"$f":"D21*(I21-G21)/100","v":0}]
[null,"下層路盤",null,null,null,null,null,{"$f":"D22*G22/100","v":0},{"$f":"E22+F22","v":0},{"$f":"D22*I22/100","v":0},null,{"$f":"I22-G22","v":0},{"$f":"D22*(I22-G22)/100","v":0}]
[null,"合計",null,{"$f":"SUM(D19:D22)","v":0},"-","-","-",{"$f":"SUM(H19:H22)","v":0},"-",{"$f":"SUM(J19:J22)","v":0},null,"-",{"$f":"SUM(M19:M22)","v":0}]
[]
["浸透マス・トレンチ"]
[]
[null,"浸透能諸元",null,null,null,null,null,null,null,null,"空隙貯留諸元"]
[null,"【浸透ます】",null,"単位設計浸透能",null,"設置数量\n（個）","設計水頭\n(m)","影響係数",null,null,"【浸透ます】\n1個あたり","ます部","砕石部",null,null,"Σ","設計浸透量","平均設計水頭","設計空隙貯留量"]
[null,null,null,"比浸透量（㎡）","飽和透水係数\n（cm/s）",null,null,"地下水位\n係数","目詰まり\n係数",null,null,"体積\n（ｍ3）","体積\n（ｍ3）","空隙率\n（％）"]
[null,null,null,null,null,null,null,null,null,null,null,null,null,null,"小計"]
[null,1,null,null,null,null,null,1,1,null,1,null,null,null,null,{"$f":"D31*E31*F31*G31*H31*I31","v":0},{"$f":"D31*E31*F31*H31*I31","v":0},null,{"$f":"L31*M31/100","v":0}]
[null,2,null,null,null,null,null,1,1,null,2,null,null,null,null,{"$f":"D32*E32*F32*G32*H32*I32","v":0},{"$f":"D32*E32*F32*H32*I32","v":0},null,{"$f":"L32*M32/100","v":0}]
[null,3,null,null,null,null,null,1,1,null,3,null,null,null,null,0,0,null,0]
[null,4,null,null,null,null,null,1,1,null,4,null,null,null,null,0,0,null,0]
[null,5,null,null,null,null,null,1,1,null,5,null,null,null,null,0,0,null,0]
[null,6,null,null,null,null,null,1,1,null,6,null,null,null,null,0,0,null,0]
[null,7,null,null,null,null,null,1,1,null,7,null,null,null,null,0,0,null,0]
[null,8,null,null,null,null,null,1,1,null,8,null,null,null,null,0,0,null,0]
[null,9,null,null,null,null,null,1,1,null,9,null,null,null,null,0,0,null,0]
[null,10,null,null,null,null,null,1,1,null,10,null,null,null,null,0,0,null,0]
[]
[null,"【浸透トレンチ】",null,"単位設計浸透能",null,"設置数量\n（ｍ）","設計水頭\n(m)","影響係数",null,null,"【浸透トレンチ】\n1mあたり","浸透管部","砕石部"]
[null,null,null,"比浸透量（㎡）","飽和透水係数\n（cm/s）",null,null,"地下水位\n係数","目詰まり\n係数",null,null,"体積\n（ｍ3）","体積\n（ｍ3）","空隙率\n（％）"]
[]
[null,1,null,null,null,null,null,1,1,null,1,null,null,null,null,{"$f":"D45*E45*F45*G45*H45*I45","v":0},{"$f":"D45*E45*F45*H45*I45","v":0},null,{"$f":"L45*M45/100","v":0}]
[null,2,null,null,null,null,null,1,1,null,2,null,null,null,null,{"$f":"D46*E46*F46*G46*H46*I46","v":0},{"$f":"D46*E46*F46*H46*I46","v":0},null,0]
[null,3,null,null,null,null,null,1,1,null,3,null,null,null,null,0,0,null,0]
[null,4,null,null,null,null,null,1,1,null,4,null,null,null,null,0,0,null,0]
[null,5,null,null,null,null,null,1,1,null,5,null,null,null,null,0,0,null,0]
[null,6,null,null,null,null,null,1,1,null,6,null,null,null,null,0,0,null,0]
[null,7,null,null,null,null,null,1,1,null,7,null,null,null,null,0,0,null,0]
[null,8,null,null,null,null,null,1,1,null,8,null,null,null,null,0,0,null,0]
[null,9,null,null,null,null,null,1,1,null,9,null,null,null,null,0,0,null,0]
[null,10,null,null,null,null,null,1,1,null,10,null,null,null,null,0,0,null,0]
[]
[null,"統合諸元"]
[null,"設計浸透能(m3/hr)",null,{"$f":"Q59","v":0}]
[null,"平均設計水頭(m)",null,{"$f":"IF(D57>0,+R59,0)","v":0}]
[null,"設計空隙貯留量(m3)",null,{"$f":"S59","v":0},null,null,null,null,null,null,null,null,null,null,"総合計",{"$f":"P61+P62","v":0},{"$f":"Q61+Q62","v":0},{"$f":"P59/Q59","v":{"$error":"#DIV/0!"}},{"$f":"S61+S62","v":0}]
[]
[null,null,null,null,null,null,null,null,null,null,null,null,null,null,"マス",{"$f":"SUM(P31:P40)","v":0},{"$f":"SUM(Q31:Q40)","v":0},{"$f":"P61/Q61","v":{"$error":"#DIV/0!"}},{"$f":"SUM(S31:S40)","v":0}]
[null,null,null,null,null,null,null,null,null,null,null,null,null,null,"トレンチ",{"$f":"SUM(P45:P54)","v":0},{"$f":"SUM(Q45:Q54)","v":0},{"$f":"P62/Q62","v":{"$error":"#DIV/0!"}},{"$f":"SUM(S45:S54)","v":0}]

{"sheet":"調節計算結果","index":11,"n_rows":7,"n_cols":9,"rows_kept":7,"cut":false,"hidden":false,"merged":[]}
[null,null,null,null,null,null,null,null,"【提出様式】"]
["調節計算結果（流量ハイドログラフ）　　"]
[null,"【貯留量】"]
[null,"計画貯留施設容量",{"$f":"MAX('施設諸元（ポンプ）'!C7:C56)","v":0},"m3","≧","必要貯留施設容量",{"$f":"'コントロールシート（貯留＋浸透）'!G15","v":0},"m3",{"$f":"IF(C4>=G4,\"OK\",\"NG\")","v":"OK"}]
[null,"【放流量】"]
[null,"最大流入量（行為後）",{"$f":"事前相談チェックシート!R13","v":{"$error":"#DIV/0!"}},"m3/s"]
[null,"最大放流量",{"$f":"'コントロールシート（貯留＋浸透）'!L18","v":9.5699999999999993E-2},"m3/s","≦","許容放流量",{"$f":"事前相談チェックシート!U25","v":99999},"m3/s",{"$f":"IF(C7<=G7,\"OK\",\"NG\")","v":"OK"}]

{"sheet":"許可申請書","index":12,"n_rows":53,"n_cols":10,"rows_kept":53,"cut":false,"hidden":false,"merged":[[14,5,15,8],[16,5,17,8],[20,6,21,10],[22,6,23,10],[29,4,29,6],[29,7,29,10],[25,6,25,10],[26,2,26,5],[26,6,26,10],[28,6,28,10],[24,2,24,5],[24,6,24,10],[25,2,25,5],[42,2,44,10],[30,4,30,10],[31,4,31,6],[31,7,31,10],[33,7,34,10],[36,2,37,10],[39,2,41,10],[22,1,23,1],[22,2,23,5],[6,0,6,8],[9,0,9,8],[12,0,12,3],[18,0,28,0],[18,2,18,5],[18,6,18,10],[19,2,19,5],[19,6,19,10],[20,1,21,1],[20,2,21,5],[13,0,13,3],[27,2,27,5],[27,6,27,10],[28,2,28,5]]}
["別記様式第二（第十六条関係）"]
[null,null,null,null,null,null,"許可申請"]
[null,null,null,null,null,"雨水浸透阻害行為",null,"書"]
[null,null,null,null,null,null,"協　　議"]
[]
[null,null,null,null,"　第３０条",null,null,null,null,"※"]
["　特定都市河川浸水被害対策法　　    　　 の規定により、雨水浸透阻害行為",null,null,null,null,null,null,null,null,"手数料欄"]
[null,null,null,null,"第３５条"]
[null,null," 　　 許可を申請"]
["について　　　　　　 します。"]
[null,null,"　 協　　　議"]
[]
["　　年　　月　　日"]
["　　　　　　　 　殿　 "]
[null,null,null,null,"住所",{"$f":"事前相談書!H17","v":0}]
[]
[null,null,null,null,"氏名",{"$f":"事前相談書!H19","v":0}]
[]
["雨水浸透阻害行為等の概要","１","雨水浸透阻害行為の区域に含まれる地域の名称",null,null,null,{"$f":"事前相談書!G8","v":0}]
[null,"２","雨水浸透阻害行為区域の面積",null,null,null,{"$f":"事前相談チェックシート!R5*10000","v":0}]
[null,"３","雨水浸透阻害行為に関する工事の計画の概要",null,null,null,{"$f":"事前相談書!G14","v":0}]
[]
[null,"４","対策工事の計画の概要"]
[]
[null,"５","雨水浸透阻害行為に関する工事の着手予定日",null,null,null,"　　年　　月　　日"]
[null,"６","雨水浸透阻害行為に関する工事の完了予定日",null,null,null,"　　年　　月　　日"]
[null,"７","対策工事の着手予定日",null,null,null,"　　年　　月　　日"]
[null,"８","対策工事の完了予定日",null,null,null,"　　年　　月　　日"]
[null,"９","その他必要な事項"]
["※受付番号",null,null,null,"　　年　　月　　日",null,null,"第　　　　号"]
["※許可に付した条件"]
["※許可番号",null,null,null,"　　年　　月　　日",null,null,"第　　　　号"]
["備考"]
[null,"１","　「許可申請　、 「第３０ 条   、 「許可を申請",null,null,null,null,"については、該当するものを○で"]
[null,null,"　　協　　議」　   第３５条」　　 協　  　議」"]
[null,null,"囲むこと。"]
[null,"２","　許可申請者が法人である場合においては、氏名は、その法人の名称及び代表者の氏名を記載すること。"]
[]
[null,"３","　※印のある欄は記載しないこと。"]
[null,"４","　雨水浸透阻害行為に関する工事の計画及び対策工事の計画については、概要の記述の末尾に「（計画の詳細は、別葉の計画説明書及び計画図による。）」と記載し、それぞれ計画説明書及び計画図を別葉とすること。"]
[]
[]
[null,"５","　「その他の必要な事項」の欄には、雨水浸透阻害行為を行うことについて、都市計画法、農地法その他の法令による許可、認可等を要する場合には、その手続の状況を記載すること。"]
[]
[]
[]
[]
[]
[]
[]
[]
[]
[null,null,null,"　"]

{"sheet":"計画説明書","index":13,"n_rows":27,"n_cols":11,"rows_kept":27,"cut":false,"hidden":false,"merged":[[25,1,25,10],[26,0,26,10],[21,1,24,3],[19,0,24,0],[19,1,19,3],[19,4,19,5],[19,6,19,8],[19,9,19,10],[20,1,20,3],[20,4,20,5],[20,6,20,8],[20,9,20,10],[21,4,21,6],[21,7,21,10],[22,4,24,6],[22,7,24,10],[14,0,18,0],[14,1,15,1],[14,2,15,2],[14,3,15,3],[14,4,15,4],[1,0,1,10],[9,0,13,0],[9,1,10,1],[9,2,10,2],[9,3,10,3],[9,4,10,4],[2,1,2,10],[3,1,3,10],[4,1,4,10],[5,1,5,10],[6,1,6,10],[7,1,7,10],[8,1,8,10]]}
["様式－１（特定都市河川浸水被害対策法施行規則 第16条関係）"]
["計　画　説　明　書"]
["申請者"]
["設計者"]
["工事施工者"]
["施設管理者"]
["雨水浸透阻害行為の区域に含まれる地域の名称",{"$f":"事前相談書!G8","v":0}]
["雨水浸透阻害行為に関する工事及び対策工事の計画の方針"]
["対策工事の計画の概要"]
["行為区域(対策工事に係る雨水貯留浸透施設の集水区域が行為区域の範囲を超えるときは、当該超える区域を含む。)内の土地の現況(m2)","宅　地","池　沼","水　路","ため池","道　路","道　路","鉄道線路","鉄道線路","飛行場","飛行場"]
[null,null,null,null,null,"(法面無)","(法面有)","(法面無)","(法面有)","(法面無)","(法面有)"]
[null,{"$f":"事前相談入力シート!C23*10000","v":0},{"$f":"事前相談入力シート!D23*10000","v":0},{"$f":"事前相談入力シート!E23*10000","v":0},{"$f":"事前相談入力シート!F23*10000","v":0},{"$f":"事前相談入力シート!G23*10000","v":0},{"$f":"事前相談入力シート!H23*10000","v":0},{"$f":"事前相談入力シート!I23*10000","v":0},{"$f":"事前相談入力シート!J23*10000","v":0},{"$f":"事前相談入力シート!K23*10000","v":0},{"$f":"事前相談入力シート!L23*10000","v":0}]
[null,"太陽光\nパネル","舗装された土地(法面を除く。)","舗装された土地(法面)","ゴルフ場","運動場","締め固められた土地","山　地","植生に覆われた法面","林地・耕地・原野その他","合　計"]
[null,{"$f":"事前相談入力シート!M23*10000","v":0},{"$f":"事前相談入力シート!N23*10000","v":0},{"$f":"事前相談入力シート!O23*10000","v":0},{"$f":"事前相談入力シート!P23*10000","v":0},{"$f":"事前相談入力シート!Q23*10000","v":0},{"$f":"事前相談入力シート!R23*10000","v":0},{"$f":"事前相談入力シート!S23*10000","v":0},{"$f":"事前相談入力シート!T23*10000","v":0},{"$f":"事前相談入力シート!U23*10000","v":0},{"$f":"SUM(B12:K12,B14:J14)","v":0}]
["行為区域(対策工事に係る雨水貯留浸透施設の集水区域が行為区域の範囲を超えるときは、当該超える区域を含む。)内の土地利用計画(m2)","宅　地","池　沼","水　路","ため池","道　路","道　路","鉄道線路","鉄道線路","飛行場","飛行場"]
[null,null,null,null,null,"(法面無)","(法面有)","(法面無)","(法面有)","(法面無)","(法面有)"]
[null,{"$f":"事前相談入力シート!C46*10000","v":0},{"$f":"事前相談入力シート!D46*10000","v":0},{"$f":"事前相談入力シート!E46*10000","v":0},{"$f":"事前相談入力シート!F46*10000","v":0},{"$f":"事前相談入力シート!G46*10000","v":0},{"$f":"事前相談入力シート!H46*10000","v":0},{"$f":"事前相談入力シート!I46*10000","v":0},{"$f":"事前相談入力シート!J46*10000","v":0},{"$f":"事前相談入力シート!K46*10000","v":0},{"$f":"事前相談入力シート!L46*10000","v":0}]
[null,"太陽光\nパネル","舗装された土地(法面を除く。)","舗装された土地(法面)","ゴルフ場","運動場","締め固められた土地","山　地","植生に覆われた法面","林地・耕地・原野その他","合　計"]
[null,{"$f":"事前相談入力シート!M46*10000","v":0},{"$f":"事前相談入力シート!N46*10000","v":0},{"$f":"事前相談入力シート!O46*10000","v":0},{"$f":"事前相談入力シート!P46*10000","v":0},{"$f":"事前相談入力シート!Q46*10000","v":0},{"$f":"事前相談入力シート!R46*10000","v":0},{"$f":"事前相談入力シート!S46*10000","v":0},{"$f":"事前相談入力シート!T46*10000","v":0},{"$f":"事前相談入力シート!U46*10000","v":0},{"$f":"SUM(B17:K17,B19:J19)","v":0}]
["対策工事に係る雨水貯留浸透施設の計画","行為前の流出係数",null,null,{"$f":"事前相談チェックシート!R10","v":{"$error":"#DIV/0!"}},null,"行為後の流出係数",null,null,{"$f":"事前相談チェックシート!R12","v":{"$error":"#DIV/0!"}}]
[null,"行為前の流出雨水量",null,null,{"$f":"事前相談チェックシート!R11","v":{"$error":"#DIV/0!"}},null,"行為後の流出雨水量",null,null,{"$f":"事前相談チェックシート!R13","v":{"$error":"#DIV/0!"}}]
[null,"雨水貯留浸透施設の計画",null,null,"構造名称",null,null,"容量(浸透能力)"]
[]
[]
[]
["その他"]
["備考"]

{"sheet":"mkrain","index":14,"n_rows":147,"n_cols":8,"rows_kept":147,"cut":false,"hidden":true,"merged":[]}
[null,"降雨ハイエト",null,null,null,null,{"$f":"MAX(G4:G147)","v":127}]
[null,"埼玉県南部","埼玉県北部","東京都","茨城県",null,"対象エリア"]
[]
[null,4.0869999999999997,2.9617,4.0747,2.6570999999999998,1,{"$f":"ROUND(IF(事前相談チェックシート!$U$4=mkrain!B$2,mkrain!B4,IF(事前相談チェックシート!$U$4=mkrain!C$2,mkrain!C4,IF(事前相談チェックシート!$U$4=mkrain!D$2,mkrain!D4,mkrain!E4))),1)","v":2.7},"対象エリアによって参照を変更する"]
[null,4.1269,2.9901,4.1143000000000001,2.6827999999999999,2,{"$f":"ROUND(IF(事前相談チェックシート!$U$4=mkrain!B$2,mkrain!B5,IF(事前相談チェックシート!$U$4=mkrain!C$2,mkrain!C5,IF(事前相談チェックシート!$U$4=mkrain!D$2,mkrain!D5,mkrain!E5))),1)","v":2.7}]
[null,4.1677,3.0192000000000001,4.1548999999999996,2.7090999999999998,3,{"$f":"ROUND(IF(事前相談チェックシート!$U$4=mkrain!B$2,mkrain!B6,IF(事前相談チェックシート!$U$4=mkrain!C$2,mkrain!C6,IF(事前相談チェックシート!$U$4=mkrain!D$2,mkrain!D6,mkrain!E6))),1)","v":2.7}]
[null,4.2096,3.0489999999999999,4.1966000000000001,2.7361,4,{"$f":"ROUND(IF(事前相談チェックシート!$U$4=mkrain!B$2,mkrain!B7,IF(事前相談チェックシート!$U$4=mkrain!C$2,mkrain!C7,IF(事前相談チェックシート!$U$4=mkrain!D$2,mkrain!D7,mkrain!E7))),1)","v":2.7}]
[null,4.2525000000000004,3.0794999999999999,4.2393000000000001,2.7637999999999998,5,{"$f":"ROUND(IF(事前相談チェックシート!$U$4=mkrain!B$2,mkrain!B8,IF(事前相談チェックシート!$U$4=mkrain!C$2,mkrain!C8,IF(事前相談チェックシート!$U$4=mkrain!D$2,mkrain!D8,mkrain!E8))),1)","v":2.8}]
[null,4.2965,3.1107999999999998,4.2830000000000004,2.7921,6,{"$f":"ROUND(IF(事前相談チェックシート!$U$4=mkrain!B$2,mkrain!B9,IF(事前相談チェックシート!$U$4=mkrain!C$2,mkrain!C9,IF(事前相談チェックシート!$U$4=mkrain!D$2,mkrain!D9,mkrain!E9))),1)","v":2.8}]
[null,4.3417000000000003,3.1429999999999998,4.3280000000000003,2.8212000000000002,7,{"$f":"ROUND(IF(事前相談チェックシート!$U$4=mkrain!B$2,mkrain!B10,IF(事前相談チェックシート!$U$4=mkrain!C$2,mkrain!C10,IF(事前相談チェックシート!$U$4=mkrain!D$2,mkrain!D10,mkrain!E10))),1)","v":2.8}]
[null,4.3879999999999999,3.1760000000000002,4.3741000000000003,2.8511000000000002,8,{"$f":"ROUND(IF(事前相談チェックシート!$U$4=mkrain!B$2,mkrain!B11,IF(事前相談チェックシート!$U$4=mkrain!C$2,mkrain!C11,IF(事前相談チェックシート!$U$4=mkrain!D$2,mkrain!D11,mkrain!E11))),1)","v":2.9}]
[null,4.4356,3.2098,4.4214000000000002,2.8816999999999999,9,{"$f":"ROUND(IF(事前相談チェックシート!$U$4=mkrain!B$2,mkrain!B12,IF(事前相談チェックシート!$U$4=mkrain!C$2,mkrain!C12,IF(事前相談チェックシート!$U$4=mkrain!D$2,mkrain!D12,mkrain!E12))),1)","v":2.9}]
[null,4.4844999999999997,3.2446000000000002,4.47,2.9131999999999998,10,{"$f":"ROUND(IF(事前相談チェックシート!$U$4=mkrain!B$2,mkrain!B13,IF(事前相談チェックシート!$U$4=mkrain!C$2,mkrain!C13,IF(事前相談チェックシート!$U$4=mkrain!D$2,mkrain!D13,mkrain!E13))),1)","v":2.9}]
[null,4.5347999999999997,3.2803,4.5199999999999996,2.9456000000000002,11,{"$f":"ROUND(IF(事前相談チェックシート!$U$4=mkrain!B$2,mkrain!B14,IF(事前相談チェックシート!$U$4=mkrain!C$2,mkrain!C14,IF(事前相談チェックシート!$U$4=mkrain!D$2,mkrain!D14,mkrain!E14))),1)","v":2.9}]
[null,4.5864000000000003,3.3170000000000002,4.5713999999999997,2.9788999999999999,12,{"$f":"ROUND(IF(事前相談チェックシート!$U$4=mkrain!B$2,mkrain!B15,IF(事前相談チェックシート!$U$4=mkrain!C$2,mkrain!C15,IF(事前相談チェックシート!$U$4=mkrain!D$2,mkrain!D15,mkrain!E15))),1)","v":3}]
[null,4.6395999999999997,3.3548,4.6242000000000001,3.0131000000000001,13,{"$f":"ROUND(IF(事前相談チェックシート!$U$4=mkrain!B$2,mkrain!B16,IF(事前相談チェックシート!$U$4=mkrain!C$2,mkrain!C16,IF(事前相談チェックシート!$U$4=mkrain!D$2,mkrain!D16,mkrain!E16))),1)","v":3}]
[null,4.6943000000000001,3.3936000000000002,4.6786000000000003,3.0482999999999998,14,{"$f":"ROUND(IF(事前相談チェックシート!$U$4=mkrain!B$2,mkrain!B17,IF(事前相談チェックシート!$U$4=mkrain!C$2,mkrain!C17,IF(事前相談チェックシート!$U$4=mkrain!D$2,mkrain!D17,mkrain!E17))),1)","v":3}]
[null,4.7506000000000004,3.4336000000000002,4.7346000000000004,3.0844999999999998,15,{"$f":"ROUND(IF(事前相談チェックシート!$U$4=mkrain!B$2,mkrain!B18,IF(事前相談チェックシート!$U$4=mkrain!C$2,mkrain!C18,IF(事前相談チェックシート!$U$4=mkrain!D$2,mkrain!D18,mkrain!E18))),1)","v":3.1}]
[null,4.8086000000000002,3.4748000000000001,4.7923,3.1219000000000001,16,{"$f":"ROUND(IF(事前相談チェックシート!$U$4=mkrain!B$2,mkrain!B19,IF(事前相談チェックシート!$U$4=mkrain!C$2,mkrain!C19,IF(事前相談チェックシート!$U$4=mkrain!D$2,mkrain!D19,mkrain!E19))),1)","v":3.1}]
[null,4.8684000000000003,3.5171999999999999,4.8517999999999999,3.1602999999999999,17,{"$f":"ROUND(IF(事前相談チェックシート!$U$4=mkrain!B$2,mkrain!B20,IF(事前相談チェックシート!$U$4=mkrain!C$2,mkrain!C20,IF(事前相談チェックシート!$U$4=mkrain!D$2,mkrain!D20,mkrain!E20))),1)","v":3.2}]
[null,4.9301000000000004,3.5609000000000002,4.9131,3.2,18,{"$f":"ROUND(IF(事前相談チェックシート!$U$4=mkrain!B$2,mkrain!B21,IF(事前相談チェックシート!$U$4=mkrain!C$2,mkrain!C21,IF(事前相談チェックシート!$U$4=mkrain!D$2,mkrain!D21,mkrain!E21))),1)","v":3.2}]
[null,4.9936999999999996,3.6059999999999999,4.9763999999999999,3.2410000000000001,19,{"$f":"ROUND(IF(事前相談チェックシート!$U$4=mkrain!B$2,mkrain!B22,IF(事前相談チェックシート!$U$4=mkrain!C$2,mkrain!C22,IF(事前相談チェックシート!$U$4=mkrain!D$2,mkrain!D22,mkrain!E22))),1)","v":3.2}]
[null,5.0594000000000001,3.6526000000000001,5.0416999999999996,3.2831999999999999,20,{"$f":"ROUND(IF(事前相談チェックシート!$U$4=mkrain!B$2,mkrain!B23,IF(事前相談チェックシート!$U$4=mkrain!C$2,mkrain!C23,IF(事前相談チェックシート!$U$4=mkrain!D$2,mkrain!D23,mkrain!E23))),1)","v":3.3}]
[null,5.1273,3.7006999999999999,5.1092000000000004,3.3269000000000002,21,{"$f":"ROUND(IF(事前相談チェックシート!$U$4=mkrain!B$2,mkrain!B24,IF(事前相談チェックシート!$U$4=mkrain!C$2,mkrain!C24,IF(事前相談チェックシート!$U$4=mkrain!D$2,mkrain!D24,mkrain!E24))),1)","v":3.3}]
[null,5.1974999999999998,3.7504,5.1790000000000003,3.3719999999999999,22,{"$f":"ROUND(IF(事前相談チェックシート!$U$4=mkrain!B$2,mkrain!B25,IF(事前相談チェックシート!$U$4=mkrain!C$2,mkrain!C25,IF(事前相談チェックシート!$U$4=mkrain!D$2,mkrain!D25,mkrain!E25))),1)","v":3.4}]
[null,5.2701000000000002,3.8018000000000001,5.2511999999999999,3.4186999999999999,23,{"$f":"ROUND(IF(事前相談チェックシート!$U$4=mkrain!B$2,mkrain!B26,IF(事前相談チェックシート!$U$4=mkrain!C$2,mkrain!C26,IF(事前相談チェックシート!$U$4=mkrain!D$2,mkrain!D26,mkrain!E26))),1)","v":3.4}]
[null,5.3452999999999999,3.855,5.3258999999999999,3.4670000000000001,24,{"$f":"ROUND(IF(事前相談チェックシート!$U$4=mkrain!B$2,mkrain!B27,IF(事前相談チェックシート!$U$4=mkrain!C$2,mkrain!C27,IF(事前相談チェックシート!$U$4=mkrain!D$2,mkrain!D27,mkrain!E27))),1)","v":3.5}]
[null,5.4231999999999996,3.9100999999999999,5.4032999999999998,3.5171000000000001,25,{"$f":"ROUND(IF(事前相談チェックシート!$U$4=mkrain!B$2,mkrain!B28,IF(事前相談チェックシート!$U$4=mkrain!C$2,mkrain!C28,IF(事前相談チェックシート!$U$4=mkrain!D$2,mkrain!D28,mkrain!E28))),1)","v":3.5}]
[null,5.5038999999999998,3.9672000000000001,5.4836,3.5689000000000002,26,{"$f":"ROUND(IF(事前相談チェックシート!$U$4=mkrain!B$2,mkrain!B29,IF(事前相談チェックシート!$U$4=mkrain!C$2,mkrain!C29,IF(事前相談チェックシート!$U$4=mkrain!D$2,mkrain!D29,mkrain!E29))),1)","v":3.6}]
[null,5.5876999999999999,4.0265000000000004,5.5667999999999997,3.6227,27,{"$f":"ROUND(IF(事前相談チェックシート!$U$4=mkrain!B$2,mkrain!B30,IF(事前相談チェックシート!$U$4=mkrain!C$2,mkrain!C30,IF(事前相談チェックシート!$U$4=mkrain!D$2,mkrain!D30,mkrain!E30))),1)","v":3.6}]
[null,5.6746999999999996,4.0879000000000003,5.6532999999999998,3.6785999999999999,28,{"$f":"ROUND(IF(事前相談チェックシート!$U$4=mkrain!B$2,mkrain!B31,IF(事前相談チェックシート!$U$4=mkrain!C$2,mkrain!C31,IF(事前相談チェックシート!$U$4=mkrain!D$2,mkrain!D31,mkrain!E31))),1)","v":3.7}]
[null,5.7651000000000003,4.1517999999999997,5.7431000000000001,3.7366999999999999,29,{"$f":"ROUND(IF(事前相談チェックシート!$U$4=mkrain!B$2,mkrain!B32,IF(事前相談チェックシート!$U$4=mkrain!C$2,mkrain!C32,IF(事前相談チェックシート!$U$4=mkrain!D$2,mkrain!D32,mkrain!E32))),1)","v":3.7}]
[null,5.8590999999999998,4.2182000000000004,5.8365999999999998,3.7970999999999999,30,{"$f":"ROUND(IF(事前相談チェックシート!$U$4=mkrain!B$2,mkrain!B33,IF(事前相談チェックシート!$U$4=mkrain!C$2,mkrain!C33,IF(事前相談チェックシート!$U$4=mkrain!D$2,mkrain!D33,mkrain!E33))),1)","v":3.8}]
[null,5.9570999999999996,4.2873000000000001,5.9339000000000004,3.8599000000000001,31,{"$f":"ROUND(IF(事前相談チェックシート!$U$4=mkrain!B$2,mkrain!B34,IF(事前相談チェックシート!$U$4=mkrain!C$2,mkrain!C34,IF(事前相談チェックシート!$U$4=mkrain!D$2,mkrain!D34,mkrain!E34))),1)","v":3.9}]
[null,6.0590999999999999,4.3593000000000002,6.0354000000000001,3.9253999999999998,32,{"$f":"ROUND(IF(事前相談チェックシート!$U$4=mkrain!B$2,mkrain!B35,IF(事前相談チェックシート!$U$4=mkrain!C$2,mkrain!C35,IF(事前相談チェックシート!$U$4=mkrain!D$2,mkrain!D35,mkrain!E35))),1)","v":3.9}]
[null,6.1656000000000004,4.4344000000000001,6.1412000000000004,3.9937999999999998,33,{"$f":"ROUND(IF(事前相談チェックシート!$U$4=mkrain!B$2,mkrain!B36,IF(事前相談チェックシート!$U$4=mkrain!C$2,mkrain!C36,IF(事前相談チェックシート!$U$4=mkrain!D$2,mkrain!D36,mkrain!E36))),1)","v":4}]
[null,6.2767999999999997,4.5126999999999997,6.2516999999999996,4.0651000000000002,34,{"$f":"ROUND(IF(事前相談チェックシート!$U$4=mkrain!B$2,mkrain!B37,IF(事前相談チェックシート!$U$4=mkrain!C$2,mkrain!C37,IF(事前相談チェックシート!$U$4=mkrain!D$2,mkrain!D37,mkrain!E37))),1)","v":4.0999999999999996}]
[null,6.3930999999999996,4.5946999999999996,6.3673000000000002,4.1397000000000004,35,{"$f":"ROUND(IF(事前相談チェックシート!$U$4=mkrain!B$2,mkrain!B38,IF(事前相談チェックシート!$U$4=mkrain!C$2,mkrain!C38,IF(事前相談チェックシート!$U$4=mkrain!D$2,mkrain!D38,mkrain!E38))),1)","v":4.0999999999999996}]
[null,6.5148999999999999,4.6803999999999997,6.4882,4.2178000000000004,36,{"$f":"ROUND(IF(事前相談チェックシート!$U$4=mkrain!B$2,mkrain!B39,IF(事前相談チェックシート!$U$4=mkrain!C$2,mkrain!C39,IF(事前相談チェックシート!$U$4=mkrain!D$2,mkrain!D39,mkrain!E39))),1)","v":4.2}]
[null,6.6425000000000001,4.7702,6.6150000000000002,4.2996999999999996,37,{"$f":"ROUND(IF(事前相談チェックシート!$U$4=mkrain!B$2,mkrain!B40,IF(事前相談チェックシート!$U$4=mkrain!C$2,mkrain!C40,IF(事前相談チェックシート!$U$4=mkrain!D$2,mkrain!D40,mkrain!E40))),1)","v":4.3}]
[null,6.7765000000000004,4.8643999999999998,6.7481999999999998,4.3855000000000004,38,{"$f":"ROUND(IF(事前相談チェックシート!$U$4=mkrain!B$2,mkrain!B41,IF(事前相談チェックシート!$U$4=mkrain!C$2,mkrain!C41,IF(事前相談チェックシート!$U$4=mkrain!D$2,mkrain!D41,mkrain!E41))),1)","v":4.4000000000000004}]
[null,6.9173,4.9634,6.8880999999999997,4.4757999999999996,39,{"$f":"ROUND(IF(事前相談チェックシート!$U$4=mkrain!B$2,mkrain!B42,IF(事前相談チェックシート!$U$4=mkrain!C$2,mkrain!C42,IF(事前相談チェックシート!$U$4=mkrain!D$2,mkrain!D42,mkrain!E42))),1)","v":4.5}]
[null,7.0655000000000001,5.0675999999999997,7.0353000000000003,4.5708000000000002,40,{"$f":"ROUND(IF(事前相談チェックシート!$U$4=mkrain!B$2,mkrain!B43,IF(事前相談チェックシート!$U$4=mkrain!C$2,mkrain!C43,IF(事前相談チェックシート!$U$4=mkrain!D$2,mkrain!D43,mkrain!E43))),1)","v":4.5999999999999996}]
[null,7.2218,5.1773999999999996,7.1905999999999999,4.6710000000000003,41,{"$f":"ROUND(IF(事前相談チェックシート!$U$4=mkrain!B$2,mkrain!B44,IF(事前相談チェックシート!$U$4=mkrain!C$2,mkrain!C44,IF(事前相談チェックシート!$U$4=mkrain!D$2,mkrain!D44,mkrain!E44))),1)","v":4.7}]
[null,7.3868999999999998,5.2933000000000003,7.3547000000000002,4.7766999999999999,42,{"$f":"ROUND(IF(事前相談チェックシート!$U$4=mkrain!B$2,mkrain!B45,IF(事前相談チェックシート!$U$4=mkrain!C$2,mkrain!C45,IF(事前相談チェックシート!$U$4=mkrain!D$2,mkrain!D45,mkrain!E45))),1)","v":4.8}]
[null,7.5616000000000003,5.4157999999999999,7.5282,4.8886000000000003,43,{"$f":"ROUND(IF(事前相談チェックシート!$U$4=mkrain!B$2,mkrain!B46,IF(事前相談チェックシート!$U$4=mkrain!C$2,mkrain!C46,IF(事前相談チェックシート!$U$4=mkrain!D$2,mkrain!D46,mkrain!E46))),1)","v":4.9000000000000004}]
[null,7.7468000000000004,5.5457000000000001,7.7122000000000002,5.0072000000000001,44,{"$f":"ROUND(IF(事前相談チェックシート!$U$4=mkrain!B$2,mkrain!B47,IF(事前相談チェックシート!$U$4=mkrain!C$2,mkrain!C47,IF(事前相談チェックシート!$U$4=mkrain!D$2,mkrain!D47,mkrain!E47))),1)","v":5}]
[null,7.9436,5.6836000000000002,7.9076000000000004,5.1332000000000004,45,{"$f":"ROUND(IF(事前相談チェックシート!$U$4=mkrain!B$2,mkrain!B48,IF(事前相談チェックシート!$U$4=mkrain!C$2,mkrain!C48,IF(事前相談チェックシート!$U$4=mkrain!D$2,mkrain!D48,mkrain!E48))),1)","v":5.0999999999999996}]
[null,8.1531000000000002,5.8303000000000003,8.1158000000000001,5.2674000000000003,46,{"$f":"ROUND(IF(事前相談チェックシート!$U$4=mkrain!B$2,mkrain!B49,IF(事前相談チェックシート!$U$4=mkrain!C$2,mkrain!C49,IF(事前相談チェックシート!$U$4=mkrain!D$2,mkrain!D49,mkrain!E49))),1)","v":5.3}]
[null,8.3766999999999996,5.9867999999999997,8.3378999999999994,5.4104999999999999,47,{"$f":"ROUND(IF(事前相談チェックシート!$U$4=mkrain!B$2,mkrain!B50,IF(事前相談チェックシート!$U$4=mkrain!C$2,mkrain!C50,IF(事前相談チェックシート!$U$4=mkrain!D$2,mkrain!D50,mkrain!E50))),1)","v":5.4}]
[null,8.6159999999999997,6.1542000000000003,8.5755999999999997,5.5636000000000001,48,{"$f":"ROUND(IF(事前相談チェックシート!$U$4=mkrain!B$2,mkrain!B51,IF(事前相談チェックシート!$U$4=mkrain!C$2,mkrain!C51,IF(事前相談チェックシート!$U$4=mkrain!D$2,mkrain!D51,mkrain!E51))),1)","v":5.6}]
[null,8.8727,6.3337000000000003,8.8306000000000004,5.7279,49,{"$f":"ROUND(IF(事前相談チェックシート!$U$4=mkrain!B$2,mkrain!B52,IF(事前相談チェックシート!$U$4=mkrain!C$2,mkrain!C52,IF(事前相談チェックシート!$U$4=mkrain!D$2,mkrain!D52,mkrain!E52))),1)","v":5.7}]
[null,9.1491000000000007,6.5267999999999997,9.1051000000000002,5.9047000000000001,50,{"$f":"ROUND(IF(事前相談チェックシート!$U$4=mkrain!B$2,mkrain!B53,IF(事前相談チェックシート!$U$4=mkrain!C$2,mkrain!C53,IF(事前相談チェックシート!$U$4=mkrain!D$2,mkrain!D53,mkrain!E53))),1)","v":5.9}]
[null,9.4474999999999998,6.7351999999999999,9.4016000000000002,6.0956000000000001,51,{"$f":"ROUND(IF(事前相談チェックシート!$U$4=mkrain!B$2,mkrain!B54,IF(事前相談チェックシート!$U$4=mkrain!C$2,mkrain!C54,IF(事前相談チェックシート!$U$4=mkrain!D$2,mkrain!D54,mkrain!E54))),1)","v":6.1}]
[null,9.7708999999999993,6.9608999999999996,9.7227999999999994,6.3025000000000002,52,{"$f":"ROUND(IF(事前相談チェックシート!$U$4=mkrain!B$2,mkrain!B55,IF(事前相談チェックシート!$U$4=mkrain!C$2,mkrain!C55,IF(事前相談チェックシート!$U$4=mkrain!D$2,mkrain!D55,mkrain!E55))),1)","v":6.3}]
[null,10.1229,7.2064000000000004,10.0725,6.5277000000000003,53,{"$f":"ROUND(IF(事前相談チェックシート!$U$4=mkrain!B$2,mkrain!B56,IF(事前相談チェックシート!$U$4=mkrain!C$2,mkrain!C56,IF(事前相談チェックシート!$U$4=mkrain!D$2,mkrain!D56,mkrain!E56))),1)","v":6.5}]
[null,10.5075,7.4745999999999997,10.454599999999999,6.7736999999999998,54,{"$f":"ROUND(IF(事前相談チェックシート!$U$4=mkrain!B$2,mkrain!B57,IF(事前相談チェックシート!$U$4=mkrain!C$2,mkrain!C57,IF(事前相談チェックシート!$U$4=mkrain!D$2,mkrain!D57,mkrain!E57))),1)","v":6.8}]
[null,10.9299,7.7689000000000004,10.8742,7.0438999999999998,55,{"$f":"ROUND(IF(事前相談チェックシート!$U$4=mkrain!B$2,mkrain!B58,IF(事前相談チェックシート!$U$4=mkrain!C$2,mkrain!C58,IF(事前相談チェックシート!$U$4=mkrain!D$2,mkrain!D58,mkrain!E58))),1)","v":7}]
[null,11.3962,8.0937000000000001,11.3376,7.3422000000000001,56,{"$f":"ROUND(IF(事前相談チェックシート!$U$4=mkrain!B$2,mkrain!B59,IF(事前相談チェックシート!$U$4=mkrain!C$2,mkrain!C59,IF(事前相談チェックシート!$U$4=mkrain!D$2,mkrain!D59,mkrain!E59))),1)","v":7.3}]
[null,11.914300000000001,8.4544999999999995,11.852399999999999,7.6737000000000002,57,{"$f":"ROUND(IF(事前相談チェックシート!$U$4=mkrain!B$2,mkrain!B60,IF(事前相談チェックシート!$U$4=mkrain!C$2,mkrain!C60,IF(事前相談チェックシート!$U$4=mkrain!D$2,mkrain!D60,mkrain!E60))),1)","v":7.7}]
[null,12.4937,8.8577999999999992,12.4283,8.0446000000000009,58,{"$f":"ROUND(IF(事前相談チェックシート!$U$4=mkrain!B$2,mkrain!B61,IF(事前相談チェックシート!$U$4=mkrain!C$2,mkrain!C61,IF(事前相談チェックシート!$U$4=mkrain!D$2,mkrain!D61,mkrain!E61))),1)","v":8}]
[null,13.1469,9.3124000000000002,13.077500000000001,8.4627999999999997,59,{"$f":"ROUND(IF(事前相談チェックシート!$U$4=mkrain!B$2,mkrain!B62,IF(事前相談チェックシート!$U$4=mkrain!C$2,mkrain!C62,IF(事前相談チェックシート!$U$4=mkrain!D$2,mkrain!D62,mkrain!E62))),1)","v":8.5}]
[null,13.889799999999999,9.8294999999999995,13.8162,8.9387000000000008,60,{"$f":"ROUND(IF(事前相談チェックシート!$U$4=mkrain!B$2,mkrain!B63,IF(事前相談チェックシート!$U$4=mkrain!C$2,mkrain!C63,IF(事前相談チェックシート!$U$4=mkrain!D$2,mkrain!D63,mkrain!E63))),1)","v":8.9}]
[null,14.743499999999999,10.4239,14.6653,9.4861000000000004,61,{"$f":"ROUND(IF(事前相談チェックシート!$U$4=mkrain!B$2,mkrain!B64,IF(事前相談チェックシート!$U$4=mkrain!C$2,mkrain!C64,IF(事前相談チェックシート!$U$4=mkrain!D$2,mkrain!D64,mkrain!E64))),1)","v":9.5}]
[null,15.736700000000001,11.1158,15.653600000000001,10.1236,62,{"$f":"ROUND(IF(事前相談チェックシート!$U$4=mkrain!B$2,mkrain!B65,IF(事前相談チェックシート!$U$4=mkrain!C$2,mkrain!C65,IF(事前相談チェックシート!$U$4=mkrain!D$2,mkrain!D65,mkrain!E65))),1)","v":10.1}]
[null,16.909099999999999,11.9335,16.820699999999999,10.8772,63,{"$f":"ROUND(IF(事前相談チェックシート!$U$4=mkrain!B$2,mkrain!B66,IF(事前相談チェックシート!$U$4=mkrain!C$2,mkrain!C66,IF(事前相談チェックシート!$U$4=mkrain!D$2,mkrain!D66,mkrain!E66))),1)","v":10.9}]
[null,18.317499999999999,12.9176,18.223800000000001,11.7844,64,{"$f":"ROUND(IF(事前相談チェックシート!$U$4=mkrain!B$2,mkrain!B67,IF(事前相談チェックシート!$U$4=mkrain!C$2,mkrain!C67,IF(事前相談チェックシート!$U$4=mkrain!D$2,mkrain!D67,mkrain!E67))),1)","v":11.8}]
[null,20.046700000000001,14.129300000000001,19.948,12.901199999999999,65,{"$f":"ROUND(IF(事前相談チェックシート!$U$4=mkrain!B$2,mkrain!B68,IF(事前相談チェックシート!$U$4=mkrain!C$2,mkrain!C68,IF(事前相談チェックシート!$U$4=mkrain!D$2,mkrain!D68,mkrain!E68))),1)","v":12.9}]
[null,22.229099999999999,15.6655,22.126999999999999,14.3164,66,{"$f":"ROUND(IF(事前相談チェックシート!$U$4=mkrain!B$2,mkrain!B69,IF(事前相談チェックシート!$U$4=mkrain!C$2,mkrain!C69,IF(事前相談チェックシート!$U$4=mkrain!D$2,mkrain!D69,mkrain!E69))),1)","v":14.3}]
[null,25.085100000000001,17.690000000000001,24.983499999999999,16.178999999999998,67,{"$f":"ROUND(IF(事前相談チェックシート!$U$4=mkrain!B$2,mkrain!B70,IF(事前相談チェックシート!$U$4=mkrain!C$2,mkrain!C70,IF(事前相談チェックシート!$U$4=mkrain!D$2,mkrain!D70,mkrain!E70))),1)","v":16.2}]
[null,29.012899999999998,20.505800000000001,28.922000000000001,18.762599999999999,68,{"$f":"ROUND(IF(事前相談チェックシート!$U$4=mkrain!B$2,mkrain!B71,IF(事前相談チェックシート!$U$4=mkrain!C$2,mkrain!C71,IF(事前相談チェックシート!$U$4=mkrain!D$2,mkrain!D71,mkrain!E71))),1)","v":18.8}]
[null,34.82,24.7499,34.7682,22.634899999999998,69,{"$f":"ROUND(IF(事前相談チェックシート!$U$4=mkrain!B$2,mkrain!B72,IF(事前相談チェックシート!$U$4=mkrain!C$2,mkrain!C72,IF(事前相談チェックシート!$U$4=mkrain!D$2,mkrain!D72,mkrain!E72))),1)","v":22.6}]
[null,44.465800000000002,32.059399999999997,44.544400000000003,29.223600000000001,70,{"$f":"ROUND(IF(事前相談チェックシート!$U$4=mkrain!B$2,mkrain!B73,IF(事前相談チェックシート!$U$4=mkrain!C$2,mkrain!C73,IF(事前相談チェックシート!$U$4=mkrain!D$2,mkrain!D73,mkrain!E73))),1)","v":29.2}]
[null,64.504400000000004,48.560499999999998,65.132000000000005,43.628399999999999,71,{"$f":"ROUND(IF(事前相談チェックシート!$U$4=mkrain!B$2,mkrain!B74,IF(事前相談チェックシート!$U$4=mkrain!C$2,mkrain!C74,IF(事前相談チェックシート!$U$4=mkrain!D$2,mkrain!D74,mkrain!E74))),1)","v":43.6}]
[null,155.57599999999999,172.3177,164.08529999999999,127.002,72,{"$f":"ROUND(IF(事前相談チェックシート!$U$4=mkrain!B$2,mkrain!B75,IF(事前相談チェックシート!$U$4=mkrain!C$2,mkrain!C75,IF(事前相談チェックシート!$U$4=mkrain!D$2,mkrain!D75,mkrain!E75))),1)","v":127}]
[null,86.984200000000001,69.827200000000005,88.694000000000003,61.113900000000001,73,{"$f":"ROUND(IF(事前相談チェックシート!$U$4=mkrain!B$2,mkrain!B76,IF(事前相談チェックシート!$U$4=mkrain!C$2,mkrain!C76,IF(事前相談チェックシート!$U$4=mkrain!D$2,mkrain!D76,mkrain!E76))),1)","v":61.1}]
[null,52.301299999999998,38.279200000000003,52.548999999999999,34.7346,74,{"$f":"ROUND(IF(事前相談チェックシート!$U$4=mkrain!B$2,mkrain!B77,IF(事前相談チェックシート!$U$4=mkrain!C$2,mkrain!C77,IF(事前相談チェックシート!$U$4=mkrain!D$2,mkrain!D77,mkrain!E77))),1)","v":34.700000000000003}]
[null,38.9467,27.834099999999999,38.940399999999997,25.428599999999999,75,{"$f":"ROUND(IF(事前相談チェックシート!$U$4=mkrain!B$2,mkrain!B78,IF(事前相談チェックシート!$U$4=mkrain!C$2,mkrain!C78,IF(事前相談チェックシート!$U$4=mkrain!D$2,mkrain!D78,mkrain!E78))),1)","v":25.4}]
[null,31.602,22.385200000000001,31.524999999999999,20.480899999999998,76,{"$f":"ROUND(IF(事前相談チェックシート!$U$4=mkrain!B$2,mkrain!B79,IF(事前相談チェックシート!$U$4=mkrain!C$2,mkrain!C79,IF(事前相談チェックシート!$U$4=mkrain!D$2,mkrain!D79,mkrain!E79))),1)","v":20.5}]
[null,26.878699999999998,18.9709,26.7805,17.355399999999999,77,{"$f":"ROUND(IF(事前相談チェックシート!$U$4=mkrain!B$2,mkrain!B80,IF(事前相談チェックシート!$U$4=mkrain!C$2,mkrain!C80,IF(事前相談チェックシート!$U$4=mkrain!D$2,mkrain!D80,mkrain!E80))),1)","v":17.399999999999999}]
[null,23.553799999999999,16.6023,23.4512,15.178800000000001,78,{"$f":"ROUND(IF(事前相談チェックシート!$U$4=mkrain!B$2,mkrain!B81,IF(事前相談チェックシート!$U$4=mkrain!C$2,mkrain!C81,IF(事前相談チェックシート!$U$4=mkrain!D$2,mkrain!D81,mkrain!E81))),1)","v":15.2}]
[null,21.0702,14.848699999999999,20.9695,13.5641,79,{"$f":"ROUND(IF(事前相談チェックシート!$U$4=mkrain!B$2,mkrain!B82,IF(事前相談チェックシート!$U$4=mkrain!C$2,mkrain!C82,IF(事前相談チェックシート!$U$4=mkrain!D$2,mkrain!D82,mkrain!E82))),1)","v":13.6}]
[null,19.135100000000001,13.49,19.038900000000002,12.311999999999999,80,{"$f":"ROUND(IF(事前相談チェックシート!$U$4=mkrain!B$2,mkrain!B83,IF(事前相談チェックシート!$U$4=mkrain!C$2,mkrain!C83,IF(事前相談チェックシート!$U$4=mkrain!D$2,mkrain!D83,mkrain!E83))),1)","v":12.3}]
[null,17.5793,12.4015,17.488299999999999,11.3086,81,{"$f":"ROUND(IF(事前相談チェックシート!$U$4=mkrain!B$2,mkrain!B84,IF(事前相談チェックシート!$U$4=mkrain!C$2,mkrain!C84,IF(事前相談チェックシート!$U$4=mkrain!D$2,mkrain!D84,mkrain!E84))),1)","v":11.3}]
[null,16.297499999999999,11.5067,16.2117,10.4839,82,{"$f":"ROUND(IF(事前相談チェックシート!$U$4=mkrain!B$2,mkrain!B85,IF(事前相談チェックシート!$U$4=mkrain!C$2,mkrain!C85,IF(事前相談チェックシート!$U$4=mkrain!D$2,mkrain!D85,mkrain!E85))),1)","v":10.5}]
[null,15.220499999999999,10.7561,15.139900000000001,9.7921999999999993,83,{"$f":"ROUND(IF(事前相談チェックシート!$U$4=mkrain!B$2,mkrain!B86,IF(事前相談チェックシート!$U$4=mkrain!C$2,mkrain!C86,IF(事前相談チェックシート!$U$4=mkrain!D$2,mkrain!D86,mkrain!E86))),1)","v":9.8000000000000007}]
[null,14.3012,10.1159,14.2254,9.2025000000000006,84,{"$f":"ROUND(IF(事前相談チェックシート!$U$4=mkrain!B$2,mkrain!B87,IF(事前相談チェックシート!$U$4=mkrain!C$2,mkrain!C87,IF(事前相談チェックシート!$U$4=mkrain!D$2,mkrain!D87,mkrain!E87))),1)","v":9.1999999999999993}]
[null,13.5059,9.5623000000000005,13.4345,8.6928000000000001,85,{"$f":"ROUND(IF(事前相談チェックシート!$U$4=mkrain!B$2,mkrain!B88,IF(事前相談チェックシート!$U$4=mkrain!C$2,mkrain!C88,IF(事前相談チェックシート!$U$4=mkrain!D$2,mkrain!D88,mkrain!E88))),1)","v":8.6999999999999993}]
[null,12.8102,9.0780999999999992,12.742800000000001,8.2471999999999994,86,{"$f":"ROUND(IF(事前相談チェックシート!$U$4=mkrain!B$2,mkrain!B89,IF(事前相談チェックシート!$U$4=mkrain!C$2,mkrain!C89,IF(事前相談チェックシート!$U$4=mkrain!D$2,mkrain!D89,mkrain!E89))),1)","v":8.1999999999999993}]
[null,12.195600000000001,8.6502999999999997,12.132,7.8537999999999997,87,{"$f":"ROUND(IF(事前相談チェックシート!$U$4=mkrain!B$2,mkrain!B90,IF(事前相談チェックシート!$U$4=mkrain!C$2,mkrain!C90,IF(事前相談チェックシート!$U$4=mkrain!D$2,mkrain!D90,mkrain!E90))),1)","v":7.9}]
[null,11.648199999999999,8.2691999999999997,11.587999999999999,7.5034999999999998,88,{"$f":"ROUND(IF(事前相談チェックシート!$U$4=mkrain!B$2,mkrain!B91,IF(事前相談チェックシート!$U$4=mkrain!C$2,mkrain!C91,IF(事前相談チェックシート!$U$4=mkrain!D$2,mkrain!D91,mkrain!E91))),1)","v":7.5}]
[null,11.1571,7.9272,11.1,7.1891999999999996,89,{"$f":"ROUND(IF(事前相談チェックシート!$U$4=mkrain!B$2,mkrain!B92,IF(事前相談チェックシート!$U$4=mkrain!C$2,mkrain!C92,IF(事前相談チェックシート!$U$4=mkrain!D$2,mkrain!D92,mkrain!E92))),1)","v":7.2}]
[null,10.7136,7.6181999999999999,10.6593,6.9055,90,{"$f":"ROUND(IF(事前相談チェックシート!$U$4=mkrain!B$2,mkrain!B93,IF(事前相談チェックシート!$U$4=mkrain!C$2,mkrain!C93,IF(事前相談チェックシート!$U$4=mkrain!D$2,mkrain!D93,mkrain!E93))),1)","v":6.9}]
[null,10.3108,7.3375000000000004,10.2592,6.6478999999999999,91,{"$f":"ROUND(IF(事前相談チェックシート!$U$4=mkrain!B$2,mkrain!B94,IF(事前相談チェックシート!$U$4=mkrain!C$2,mkrain!C94,IF(事前相談チェックシート!$U$4=mkrain!D$2,mkrain!D94,mkrain!E94))),1)","v":6.6}]
[null,9.9430999999999994,7.0810000000000004,9.8939000000000004,6.4127000000000001,92,{"$f":"ROUND(IF(事前相談チェックシート!$U$4=mkrain!B$2,mkrain!B95,IF(事前相談チェックシート!$U$4=mkrain!C$2,mkrain!C95,IF(事前相談チェックシート!$U$4=mkrain!D$2,mkrain!D95,mkrain!E95))),1)","v":6.4}]
[null,9.6059000000000001,6.8457999999999997,9.5588999999999995,6.1970000000000001,93,{"$f":"ROUND(IF(事前相談チェックシート!$U$4=mkrain!B$2,mkrain!B96,IF(事前相談チェックシート!$U$4=mkrain!C$2,mkrain!C96,IF(事前相談チェックシート!$U$4=mkrain!D$2,mkrain!D96,mkrain!E96))),1)","v":6.2}]
[null,9.2954000000000008,6.6289999999999996,9.2504000000000008,5.9983000000000004,94,{"$f":"ROUND(IF(事前相談チェックシート!$U$4=mkrain!B$2,mkrain!B97,IF(事前相談チェックシート!$U$4=mkrain!C$2,mkrain!C97,IF(事前相談チェックシート!$U$4=mkrain!D$2,mkrain!D97,mkrain!E97))),1)","v":6}]
[null,9.0083000000000002,6.4284999999999997,8.9652999999999992,5.8147000000000002,95,{"$f":"ROUND(IF(事前相談チェックシート!$U$4=mkrain!B$2,mkrain!B98,IF(事前相談チェックシート!$U$4=mkrain!C$2,mkrain!C98,IF(事前相談チェックシート!$U$4=mkrain!D$2,mkrain!D98,mkrain!E98))),1)","v":5.8}]
[null,8.7420000000000009,6.2423000000000002,8.7007999999999992,5.6443000000000003,96,{"$f":"ROUND(IF(事前相談チェックシート!$U$4=mkrain!B$2,mkrain!B99,IF(事前相談チェックシート!$U$4=mkrain!C$2,mkrain!C99,IF(事前相談チェックシート!$U$4=mkrain!D$2,mkrain!D99,mkrain!E99))),1)","v":5.6}]
[null,8.4943000000000008,6.0690999999999997,8.4547000000000008,5.4856999999999996,97,{"$f":"ROUND(IF(事前相談チェックシート!$U$4=mkrain!B$2,mkrain!B100,IF(事前相談チェックシート!$U$4=mkrain!C$2,mkrain!C100,IF(事前相談チェックシート!$U$4=mkrain!D$2,mkrain!D100,mkrain!E100))),1)","v":5.5}]
[null,8.2629999999999999,5.9073000000000002,8.2249999999999996,5.3376999999999999,98,{"$f":"ROUND(IF(事前相談チェックシート!$U$4=mkrain!B$2,mkrain!B101,IF(事前相談チェックシート!$U$4=mkrain!C$2,mkrain!C101,IF(事前相談チェックシート!$U$4=mkrain!D$2,mkrain!D101,mkrain!E101))),1)","v":5.3}]
[null,8.0466999999999995,5.7557999999999998,8.01,5.1992000000000003,99,{"$f":"ROUND(IF(事前相談チェックシート!$U$4=mkrain!B$2,mkrain!B102,IF(事前相談チェックシート!$U$4=mkrain!C$2,mkrain!C102,IF(事前相談チェックシート!$U$4=mkrain!D$2,mkrain!D102,mkrain!E102))),1)","v":5.2}]
[null,7.8437000000000001,5.6135999999999999,7.8083999999999998,5.0693000000000001,100,{"$f":"ROUND(IF(事前相談チェックシート!$U$4=mkrain!B$2,mkrain!B103,IF(事前相談チェックシート!$U$4=mkrain!C$2,mkrain!C103,IF(事前相談チェックシート!$U$4=mkrain!D$2,mkrain!D103,mkrain!E103))),1)","v":5.0999999999999996}]
[null,7.6528,5.4798,7.6188000000000002,4.9470999999999998,101,{"$f":"ROUND(IF(事前相談チェックシート!$U$4=mkrain!B$2,mkrain!B104,IF(事前相談チェックシート!$U$4=mkrain!C$2,mkrain!C104,IF(事前相談チェックシート!$U$4=mkrain!D$2,mkrain!D104,mkrain!E104))),1)","v":4.9000000000000004}]
[null,7.4729999999999999,5.3536999999999999,7.4401999999999999,4.8319000000000001,102,{"$f":"ROUND(IF(事前相談チェックシート!$U$4=mkrain!B$2,mkrain!B105,IF(事前相談チェックシート!$U$4=mkrain!C$2,mkrain!C105,IF(事前相談チェックシート!$U$4=mkrain!D$2,mkrain!D105,mkrain!E105))),1)","v":4.8}]
[null,7.3032000000000004,5.2344999999999997,7.2714999999999996,4.7230999999999996,103,{"$f":"ROUND(IF(事前相談チェックシート!$U$4=mkrain!B$2,mkrain!B106,IF(事前相談チェックシート!$U$4=mkrain!C$2,mkrain!C106,IF(事前相談チェックシート!$U$4=mkrain!D$2,mkrain!D106,mkrain!E106))),1)","v":4.7}]
[null,7.1425999999999998,5.1218000000000004,7.1119000000000003,4.6201999999999996,104,{"$f":"ROUND(IF(事前相談チェックシート!$U$4=mkrain!B$2,mkrain!B107,IF(事前相談チェックシート!$U$4=mkrain!C$2,mkrain!C107,IF(事前相談チェックシート!$U$4=mkrain!D$2,mkrain!D107,mkrain!E107))),1)","v":4.5999999999999996}]
[null,6.9904000000000002,5.0148999999999999,6.9607000000000001,4.5227000000000004,105,{"$f":"ROUND(IF(事前相談チェックシート!$U$4=mkrain!B$2,mkrain!B108,IF(事前相談チェックシート!$U$4=mkrain!C$2,mkrain!C108,IF(事前相談チェックシート!$U$4=mkrain!D$2,mkrain!D108,mkrain!E108))),1)","v":4.5}]
[null,6.8460000000000001,4.9132999999999996,6.8171999999999997,4.4301000000000004,106,{"$f":"ROUND(IF(事前相談チェックシート!$U$4=mkrain!B$2,mkrain!B109,IF(事前相談チェックシート!$U$4=mkrain!C$2,mkrain!C109,IF(事前相談チェックシート!$U$4=mkrain!D$2,mkrain!D109,mkrain!E109))),1)","v":4.4000000000000004}]
[null,6.7085999999999997,4.8167999999999997,6.6807999999999996,4.3421000000000003,107,{"$f":"ROUND(IF(事前相談チェックシート!$U$4=mkrain!B$2,mkrain!B110,IF(事前相談チェックシート!$U$4=mkrain!C$2,mkrain!C110,IF(事前相談チェックシート!$U$4=mkrain!D$2,mkrain!D110,mkrain!E110))),1)","v":4.3}]
[null,6.5778999999999996,4.7248000000000001,6.5509000000000004,4.2583000000000002,108,{"$f":"ROUND(IF(事前相談チェックシート!$U$4=mkrain!B$2,mkrain!B111,IF(事前相談チェックシート!$U$4=mkrain!C$2,mkrain!C111,IF(事前相談チェックシート!$U$4=mkrain!D$2,mkrain!D111,mkrain!E111))),1)","v":4.3}]
[null,6.4532999999999996,4.6369999999999996,6.4269999999999996,4.1783000000000001,109,{"$f":"ROUND(IF(事前相談チェックシート!$U$4=mkrain!B$2,mkrain!B112,IF(事前相談チェックシート!$U$4=mkrain!C$2,mkrain!C112,IF(事前相談チェックシート!$U$4=mkrain!D$2,mkrain!D112,mkrain!E112))),1)","v":4.2}]
[null,6.3342999999999998,4.5532000000000004,6.3087999999999997,4.1020000000000003,110,{"$f":"ROUND(IF(事前相談チェックシート!$U$4=mkrain!B$2,mkrain!B113,IF(事前相談チェックシート!$U$4=mkrain!C$2,mkrain!C113,IF(事前相談チェックシート!$U$4=mkrain!D$2,mkrain!D113,mkrain!E113))),1)","v":4.0999999999999996}]
[null,6.2206000000000001,4.4730999999999996,6.1958000000000002,4.0290999999999997,111,{"$f":"ROUND(IF(事前相談チェックシート!$U$4=mkrain!B$2,mkrain!B114,IF(事前相談チェックシート!$U$4=mkrain!C$2,mkrain!C114,IF(事前相談チェックシート!$U$4=mkrain!D$2,mkrain!D114,mkrain!E114))),1)","v":4}]
[null,6.1117999999999997,4.3963999999999999,6.0876999999999999,3.9592000000000001,112,{"$f":"ROUND(IF(事前相談チェックシート!$U$4=mkrain!B$2,mkrain!B115,IF(事前相談チェックシート!$U$4=mkrain!C$2,mkrain!C115,IF(事前相談チェックシート!$U$4=mkrain!D$2,mkrain!D115,mkrain!E115))),1)","v":4}]
[null,6.0075000000000003,4.3228999999999997,5.9840999999999998,3.8923000000000001,113,{"$f":"ROUND(IF(事前相談チェックシート!$U$4=mkrain!B$2,mkrain!B116,IF(事前相談チェックシート!$U$4=mkrain!C$2,mkrain!C116,IF(事前相談チェックシート!$U$4=mkrain!D$2,mkrain!D116,mkrain!E116))),1)","v":3.9}]
[null,5.9076000000000004,4.2523999999999997,5.8848000000000003,3.8281999999999998,114,{"$f":"ROUND(IF(事前相談チェックシート!$U$4=mkrain!B$2,mkrain!B117,IF(事前相談チェックシート!$U$4=mkrain!C$2,mkrain!C117,IF(事前相談チェックシート!$U$4=mkrain!D$2,mkrain!D117,mkrain!E117))),1)","v":3.8}]
[null,5.8116000000000003,4.1845999999999997,5.7893999999999997,3.7665999999999999,115,{"$f":"ROUND(IF(事前相談チェックシート!$U$4=mkrain!B$2,mkrain!B118,IF(事前相談チェックシート!$U$4=mkrain!C$2,mkrain!C118,IF(事前相談チェックシート!$U$4=mkrain!D$2,mkrain!D118,mkrain!E118))),1)","v":3.8}]
[null,5.7194000000000003,4.1195000000000004,5.6978,3.7073999999999998,116,{"$f":"ROUND(IF(事前相談チェックシート!$U$4=mkrain!B$2,mkrain!B119,IF(事前相談チェックシート!$U$4=mkrain!C$2,mkrain!C119,IF(事前相談チェックシート!$U$4=mkrain!D$2,mkrain!D119,mkrain!E119))),1)","v":3.7}]
[null,5.6307999999999998,4.0568999999999997,5.6096000000000004,3.6503999999999999,117,{"$f":"ROUND(IF(事前相談チェックシート!$U$4=mkrain!B$2,mkrain!B120,IF(事前相談チェックシート!$U$4=mkrain!C$2,mkrain!C120,IF(事前相談チェックシート!$U$4=mkrain!D$2,mkrain!D120,mkrain!E120))),1)","v":3.7}]
[null,5.5453999999999999,3.9965999999999999,5.5247999999999999,3.5956000000000001,118,{"$f":"ROUND(IF(事前相談チェックシート!$U$4=mkrain!B$2,mkrain!B121,IF(事前相談チェックシート!$U$4=mkrain!C$2,mkrain!C121,IF(事前相談チェックシート!$U$4=mkrain!D$2,mkrain!D121,mkrain!E121))),1)","v":3.6}]
[null,5.4631999999999996,3.9384000000000001,5.4431000000000003,3.5428000000000002,119,{"$f":"ROUND(IF(事前相談チェックシート!$U$4=mkrain!B$2,mkrain!B122,IF(事前相談チェックシート!$U$4=mkrain!C$2,mkrain!C122,IF(事前相談チェックシート!$U$4=mkrain!D$2,mkrain!D122,mkrain!E122))),1)","v":3.5}]
[null,5.3838999999999997,3.8822999999999999,5.3642000000000003,3.4918,120,{"$f":"ROUND(IF(事前相談チェックシート!$U$4=mkrain!B$2,mkrain!B123,IF(事前相談チェックシート!$U$4=mkrain!C$2,mkrain!C123,IF(事前相談チェックシート!$U$4=mkrain!D$2,mkrain!D123,mkrain!E123))),1)","v":3.5}]
[null,5.3074000000000003,3.8281999999999998,5.2881999999999998,3.4426000000000001,121,{"$f":"ROUND(IF(事前相談チェックシート!$U$4=mkrain!B$2,mkrain!B124,IF(事前相談チェックシート!$U$4=mkrain!C$2,mkrain!C124,IF(事前相談チェックシート!$U$4=mkrain!D$2,mkrain!D124,mkrain!E124))),1)","v":3.4}]
[null,5.2335000000000003,3.7759,5.2148000000000003,3.3952,122,{"$f":"ROUND(IF(事前相談チェックシート!$U$4=mkrain!B$2,mkrain!B125,IF(事前相談チェックシート!$U$4=mkrain!C$2,mkrain!C125,IF(事前相談チェックシート!$U$4=mkrain!D$2,mkrain!D125,mkrain!E125))),1)","v":3.4}]
[null,5.1620999999999997,3.7254,5.1437999999999997,3.3492999999999999,123,{"$f":"ROUND(IF(事前相談チェックシート!$U$4=mkrain!B$2,mkrain!B126,IF(事前相談チェックシート!$U$4=mkrain!C$2,mkrain!C126,IF(事前相談チェックシート!$U$4=mkrain!D$2,mkrain!D126,mkrain!E126))),1)","v":3.3}]
[null,5.0930999999999997,3.6764999999999999,5.0751999999999997,3.3048999999999999,124,{"$f":"ROUND(IF(事前相談チェックシート!$U$4=mkrain!B$2,mkrain!B127,IF(事前相談チェックシート!$U$4=mkrain!C$2,mkrain!C127,IF(事前相談チェックシート!$U$4=mkrain!D$2,mkrain!D127,mkrain!E127))),1)","v":3.3}]
[null,5.0263,3.6291000000000002,5.0087999999999999,3.2618999999999998,125,{"$f":"ROUND(IF(事前相談チェックシート!$U$4=mkrain!B$2,mkrain!B128,IF(事前相談チェックシート!$U$4=mkrain!C$2,mkrain!C128,IF(事前相談チェックシート!$U$4=mkrain!D$2,mkrain!D128,mkrain!E128))),1)","v":3.3}]
[null,4.9617000000000004,3.5832999999999999,4.9444999999999997,3.2202999999999999,126,{"$f":"ROUND(IF(事前相談チェックシート!$U$4=mkrain!B$2,mkrain!B129,IF(事前相談チェックシート!$U$4=mkrain!C$2,mkrain!C129,IF(事前相談チェックシート!$U$4=mkrain!D$2,mkrain!D129,mkrain!E129))),1)","v":3.2}]
[null,4.899,3.5388999999999999,4.8822000000000001,3.18,127,{"$f":"ROUND(IF(事前相談チェックシート!$U$4=mkrain!B$2,mkrain!B130,IF(事前相談チェックシート!$U$4=mkrain!C$2,mkrain!C130,IF(事前相談チェックシート!$U$4=mkrain!D$2,mkrain!D130,mkrain!E130))),1)","v":3.2}]
[null,4.8383000000000003,3.4958,4.8217999999999996,3.141,128,{"$f":"ROUND(IF(事前相談チェックシート!$U$4=mkrain!B$2,mkrain!B131,IF(事前相談チェックシート!$U$4=mkrain!C$2,mkrain!C131,IF(事前相談チェックシート!$U$4=mkrain!D$2,mkrain!D131,mkrain!E131))),1)","v":3.1}]
[null,4.7793999999999999,3.4540000000000002,4.7632000000000003,3.1031,129,{"$f":"ROUND(IF(事前相談チェックシート!$U$4=mkrain!B$2,mkrain!B132,IF(事前相談チェックシート!$U$4=mkrain!C$2,mkrain!C132,IF(事前相談チェックシート!$U$4=mkrain!D$2,mkrain!D132,mkrain!E132))),1)","v":3.1}]
[null,4.7222,3.4134000000000002,4.7064000000000004,3.0663,130,{"$f":"ROUND(IF(事前相談チェックシート!$U$4=mkrain!B$2,mkrain!B133,IF(事前相談チェックシート!$U$4=mkrain!C$2,mkrain!C133,IF(事前相談チェックシート!$U$4=mkrain!D$2,mkrain!D133,mkrain!E133))),1)","v":3.1}]
[null,4.6666999999999996,3.3740000000000001,4.6512000000000002,3.0306000000000002,131,{"$f":"ROUND(IF(事前相談チェックシート!$U$4=mkrain!B$2,mkrain!B134,IF(事前相談チェックシート!$U$4=mkrain!C$2,mkrain!C134,IF(事前相談チェックシート!$U$4=mkrain!D$2,mkrain!D134,mkrain!E134))),1)","v":3}]
[null,4.6128,3.3357000000000001,4.5975999999999999,2.9958,132,{"$f":"ROUND(IF(事前相談チェックシート!$U$4=mkrain!B$2,mkrain!B135,IF(事前相談チェックシート!$U$4=mkrain!C$2,mkrain!C135,IF(事前相談チェックシート!$U$4=mkrain!D$2,mkrain!D135,mkrain!E135))),1)","v":3}]
[null,4.5603999999999996,3.2985000000000002,4.5454999999999997,2.9621,133,{"$f":"ROUND(IF(事前相談チェックシート!$U$4=mkrain!B$2,mkrain!B136,IF(事前相談チェックシート!$U$4=mkrain!C$2,mkrain!C136,IF(事前相談チェックシート!$U$4=mkrain!D$2,mkrain!D136,mkrain!E136))),1)","v":3}]
[null,4.5095000000000001,3.2623000000000002,4.4947999999999997,2.9293,134,{"$f":"ROUND(IF(事前相談チェックシート!$U$4=mkrain!B$2,mkrain!B137,IF(事前相談チェックシート!$U$4=mkrain!C$2,mkrain!C137,IF(事前相談チェックシート!$U$4=mkrain!D$2,mkrain!D137,mkrain!E137))),1)","v":2.9}]
[null,4.4599000000000002,3.2271000000000001,4.4455,2.8974000000000002,135,{"$f":"ROUND(IF(事前相談チェックシート!$U$4=mkrain!B$2,mkrain!B138,IF(事前相談チェックシート!$U$4=mkrain!C$2,mkrain!C138,IF(事前相談チェックシート!$U$4=mkrain!D$2,mkrain!D138,mkrain!E138))),1)","v":2.9}]
[null,4.4116999999999997,3.1928000000000001,4.3975999999999997,2.8662999999999998,136,{"$f":"ROUND(IF(事前相談チェックシート!$U$4=mkrain!B$2,mkrain!B139,IF(事前相談チェックシート!$U$4=mkrain!C$2,mkrain!C139,IF(事前相談チェックシート!$U$4=mkrain!D$2,mkrain!D139,mkrain!E139))),1)","v":2.9}]
[null,4.3647,3.1594000000000002,4.3507999999999996,2.8361000000000001,137,{"$f":"ROUND(IF(事前相談チェックシート!$U$4=mkrain!B$2,mkrain!B140,IF(事前相談チェックシート!$U$4=mkrain!C$2,mkrain!C140,IF(事前相談チェックシート!$U$4=mkrain!D$2,mkrain!D140,mkrain!E140))),1)","v":2.8}]
[null,4.319,3.1267999999999998,4.3052999999999999,2.8066,138,{"$f":"ROUND(IF(事前相談チェックシート!$U$4=mkrain!B$2,mkrain!B141,IF(事前相談チェックシート!$U$4=mkrain!C$2,mkrain!C141,IF(事前相談チェックシート!$U$4=mkrain!D$2,mkrain!D141,mkrain!E141))),1)","v":2.8}]
[null,4.2744,3.0951,4.2610000000000001,2.7778999999999998,139,{"$f":"ROUND(IF(事前相談チェックシート!$U$4=mkrain!B$2,mkrain!B142,IF(事前相談チェックシート!$U$4=mkrain!C$2,mkrain!C142,IF(事前相談チェックシート!$U$4=mkrain!D$2,mkrain!D142,mkrain!E142))),1)","v":2.8}]
[null,4.2309000000000001,3.0642,4.2178000000000004,2.7498999999999998,140,{"$f":"ROUND(IF(事前相談チェックシート!$U$4=mkrain!B$2,mkrain!B143,IF(事前相談チェックシート!$U$4=mkrain!C$2,mkrain!C143,IF(事前相談チェックシート!$U$4=mkrain!D$2,mkrain!D143,mkrain!E143))),1)","v":2.7}]
[null,4.1885000000000003,3.0339999999999998,4.1756000000000002,2.7225000000000001,141,{"$f":"ROUND(IF(事前相談チェックシート!$U$4=mkrain!B$2,mkrain!B144,IF(事前相談チェックシート!$U$4=mkrain!C$2,mkrain!C144,IF(事前相談チェックシート!$U$4=mkrain!D$2,mkrain!D144,mkrain!E144))),1)","v":2.7}]
[null,4.1471999999999998,3.0045000000000002,4.1345000000000001,2.6959,142,{"$f":"ROUND(IF(事前相談チェックシート!$U$4=mkrain!B$2,mkrain!B145,IF(事前相談チェックシート!$U$4=mkrain!C$2,mkrain!C145,IF(事前相談チェックシート!$U$4=mkrain!D$2,mkrain!D145,mkrain!E145))),1)","v":2.7}]
[null,4.1069000000000004,2.9758,4.0944000000000003,2.6699000000000002,143,{"$f":"ROUND(IF(事前相談チェックシート!$U$4=mkrain!B$2,mkrain!B146,IF(事前相談チェックシート!$U$4=mkrain!C$2,mkrain!C146,IF(事前相談チェックシート!$U$4=mkrain!D$2,mkrain!D146,mkrain!E146))),1)","v":2.7}]
[null,4.0674999999999999,2.9477000000000002,4.0552000000000001,2.6444999999999999,144,{"$f":"ROUND(IF(事前相談チェックシート!$U$4=mkrain!B$2,mkrain!B147,IF(事前相談チェックシート!$U$4=mkrain!C$2,mkrain!C147,IF(事前相談チェックシート!$U$4=mkrain!D$2,mkrain!D147,mkrain!E147))),1)","v":2.6}]

{"sheet":"runoff","index":15,"n_rows":148,"n_cols":3,"rows_kept":148,"cut":false,"hidden":true,"merged":[]}
[null,{"$f":"MAX(B4:B148)","v":{"$error":"#DIV/0!"}},{"$f":"MAX(C4:C148)","v":{"$error":"#DIV/0!"}}]
[null,"行為前","行為後"]
[null,"流出量","流出量"]
["00:00:00",0,0]
["00:10:00",{"$f":"ROUND(1/360*事前相談チェックシート!$R$10*mkrain!$G4*事前相談チェックシート!$L$28,5)","v":{"$error":"#DIV/0!"}},{"$f":"ROUND(1/360*事前相談チェックシート!$R$12*mkrain!$G4*事前相談チェックシート!$M$28,5)","v":{"$error":"#DIV/0!"}}]
["00:20:00",{"$f":"ROUND(1/360*事前相談チェックシート!$R$10*mkrain!$G5*事前相談チェックシート!$L$28,5)","v":{"$error":"#DIV/0!"}},{"$f":"ROUND(1/360*事前相談チェックシート!$R$12*mkrain!$G5*事前相談チェックシート!$M$28,5)","v":{"$error":"#DIV/0!"}}]
["00:30:00",{"$f":"ROUND(1/360*事前相談チェックシート!$R$10*mkrain!$G6*事前相談チェックシート!$L$28,5)","v":{"$error":"#DIV/0!"}},{"$f":"ROUND(1/360*事前相談チェックシート!$R$12*mkrain!$G6*事前相談チェックシート!$M$28,5)","v":{"$error":"#DIV/0!"}}]
["00:40:00",{"$f":"ROUND(1/360*事前相談チェックシート!$R$10*mkrain!$G7*事前相談チェックシート!$L$28,5)","v":{"$error":"#DIV/0!"}},{"$f":"ROUND(1/360*事前相談チェックシート!$R$12*mkrain!$G7*事前相談チェックシート!$M$28,5)","v":{"$error":"#DIV/0!"}}]
["00:50:00",{"$f":"ROUND(1/360*事前相談チェックシート!$R$10*mkrain!$G8*事前相談チェックシート!$L$28,5)","v":{"$error":"#DIV/0!"}},{"$f":"ROUND(1/360*事前相談チェックシート!$R$12*mkrain!$G8*事前相談チェックシート!$M$28,5)","v":{"$error":"#DIV/0!"}}]
["01:00:00",{"$f":"ROUND(1/360*事前相談チェックシート!$R$10*mkrain!$G9*事前相談チェックシート!$L$28,5)","v":{"$error":"#DIV/0!"}},{"$f":"ROUND(1/360*事前相談チェックシート!$R$12*mkrain!$G9*事前相談チェックシート!$M$28,5)","v":{"$error":"#DIV/0!"}}]
["01:10:00",{"$f":"ROUND(1/360*事前相談チェックシート!$R$10*mkrain!$G10*事前相談チェックシート!$L$28,5)","v":{"$error":"#DIV/0!"}},{"$f":"ROUND(1/360*事前相談チェックシート!$R$12*mkrain!$G10*事前相談チェックシート!$M$28,5)","v":{"$error":"#DIV/0!"}}]
["01:20:00",{"$f":"ROUND(1/360*事前相談チェックシート!$R$10*mkrain!$G11*事前相談チェックシート!$L$28,5)","v":{"$error":"#DIV/0!"}},{"$f":"ROUND(1/360*事前相談チェックシート!$R$12*mkrain!$G11*事前相談チェックシート!$M$28,5)","v":{"$error":"#DIV/0!"}}]
["01:30:00",{"$f":"ROUND(1/360*事前相談チェックシート!$R$10*mkrain!$G12*事前相談チェックシート!$L$28,5)","v":{"$error":"#DIV/0!"}},{"$f":"ROUND(1/360*事前相談チェックシート!$R$12*mkrain!$G12*事前相談チェックシート!$M$28,5)","v":{"$error":"#DIV/0!"}}]
["01:40:00",{"$f":"ROUND(1/360*事前相談チェックシート!$R$10*mkrain!$G13*事前相談チェックシート!$L$28,5)","v":{"$error":"#DIV/0!"}},{"$f":"ROUND(1/360*事前相談チェックシート!$R$12*mkrain!$G13*事前相談チェックシート!$M$28,5)","v":{"$error":"#DIV/0!"}}]
["01:50:00",{"$f":"ROUND(1/360*事前相談チェックシート!$R$10*mkrain!$G14*事前相談チェックシート!$L$28,5)","v":{"$error":"#DIV/0!"}},{"$f":"ROUND(1/360*事前相談チェックシート!$R$12*mkrain!$G14*事前相談チェックシート!$M$28,5)","v":{"$error":"#DIV/0!"}}]
["02:00:00",{"$f":"ROUND(1/360*事前相談チェックシート!$R$10*mkrain!$G15*事前相談チェックシート!$L$28,5)","v":{"$error":"#DIV/0!"}},{"$f":"ROUND(1/360*事前相談チェックシート!$R$12*mkrain!$G15*事前相談チェックシート!$M$28,5)","v":{"$error":"#DIV/0!"}}]
["02:10:00",{"$f":"ROUND(1/360*事前相談チェックシート!$R$10*mkrain!$G16*事前相談チェックシート!$L$28,5)","v":{"$error":"#DIV/0!"}},{"$f":"ROUND(1/360*事前相談チェックシート!$R$12*mkrain!$G16*事前相談チェックシート!$M$28,5)","v":{"$error":"#DIV/0!"}}]
["02:20:00",{"$f":"ROUND(1/360*事前相談チェックシート!$R$10*mkrain!$G17*事前相談チェックシート!$L$28,5)","v":{"$error":"#DIV/0!"}},{"$f":"ROUND(1/360*事前相談チェックシート!$R$12*mkrain!$G17*事前相談チェックシート!$M$28,5)","v":{"$error":"#DIV/0!"}}]
["02:30:00",{"$f":"ROUND(1/360*事前相談チェックシート!$R$10*mkrain!$G18*事前相談チェックシート!$L$28,5)","v":{"$error":"#DIV/0!"}},{"$f":"ROUND(1/360*事前相談チェックシート!$R$12*mkrain!$G18*事前相談チェックシート!$M$28,5)","v":{"$error":"#DIV/0!"}}]
["02:40:00",{"$f":"ROUND(1/360*事前相談チェックシート!$R$10*mkrain!$G19*事前相談チェックシート!$L$28,5)","v":{"$error":"#DIV/0!"}},{"$f":"ROUND(1/360*事前相談チェックシート!$R$12*mkrain!$G19*事前相談チェックシート!$M$28,5)","v":{"$error":"#DIV/0!"}}]
["02:50:00",{"$f":"ROUND(1/360*事前相談チェックシート!$R$10*mkrain!$G20*事前相談チェックシート!$L$28,5)","v":{"$error":"#DIV/0!"}},{"$f":"ROUND(1/360*事前相談チェックシート!$R$12*mkrain!$G20*事前相談チェックシート!$M$28,5)","v":{"$error":"#DIV/0!"}}]
["03:00:00",{"$f":"ROUND(1/360*事前相談チェックシート!$R$10*mkrain!$G21*事前相談チェックシート!$L$28,5)","v":{"$error":"#DIV/0!"}},{"$f":"ROUND(1/360*事前相談チェックシート!$R$12*mkrain!$G21*事前相談チェックシート!$M$28,5)","v":{"$error":"#DIV/0!"}}]
["03:10:00",{"$f":"ROUND(1/360*事前相談チェックシート!$R$10*mkrain!$G22*事前相談チェックシート!$L$28,5)","v":{"$error":"#DIV/0!"}},{"$f":"ROUND(1/360*事前相談チェックシート!$R$12*mkrain!$G22*事前相談チェックシート!$M$28,5)","v":{"$error":"#DIV/0!"}}]
["03:20:00",{"$f":"ROUND(1/360*事前相談チェックシート!$R$10*mkrain!$G23*事前相談チェックシート!$L$28,5)","v":{"$error":"#DIV/0!"}},{"$f":"ROUND(1/360*事前相談チェックシート!$R$12*mkrain!$G23*事前相談チェックシート!$M$28,5)","v":{"$error":"#DIV/0!"}}]
["03:30:00",{"$f":"ROUND(1/360*事前相談チェックシート!$R$10*mkrain!$G24*事前相談チェックシート!$L$28,5)","v":{"$error":"#DIV/0!"}},{"$f":"ROUND(1/360*事前相談チェックシート!$R$12*mkrain!$G24*事前相談チェックシート!$M$28,5)","v":{"$error":"#DIV/0!"}}]
["03:40:00",{"$f":"ROUND(1/360*事前相談チェックシート!$R$10*mkrain!$G25*事前相談チェックシート!$L$28,5)","v":{"$error":"#DIV/0!"}},{"$f":"ROUND(1/360*事前相談チェックシート!$R$12*mkrain!$G25*事前相談チェックシート!$M$28,5)","v":{"$error":"#DIV/0!"}}]
["03:50:00",{"$f":"ROUND(1/360*事前相談チェックシート!$R$10*mkrain!$G26*事前相談チェックシート!$L$28,5)","v":{"$error":"#DIV/0!"}},{"$f":"ROUND(1/360*事前相談チェックシート!$R$12*mkrain!$G26*事前相談チェックシート!$M$28,5)","v":{"$error":"#DIV/0!"}}]
["04:00:00",{"$f":"ROUND(1/360*事前相談チェックシート!$R$10*mkrain!$G27*事前相談チェックシート!$L$28,5)","v":{"$error":"#DIV/0!"}},{"$f":"ROUND(1/360*事前相談チェックシート!$R$12*mkrain!$G27*事前相談チェックシート!$M$28,5)","v":{"$error":"#DIV/0!"}}]
["04:10:00",{"$f":"ROUND(1/360*事前相談チェックシート!$R$10*mkrain!$G28*事前相談チェックシート!$L$28,5)","v":{"$error":"#DIV/0!"}},{"$f":"ROUND(1/360*事前相談チェックシート!$R$12*mkrain!$G28*事前相談チェックシート!$M$28,5)","v":{"$error":"#DIV/0!"}}]
["04:20:00",{"$f":"ROUND(1/360*事前相談チェックシート!$R$10*mkrain!$G29*事前相談チェックシート!$L$28,5)","v":{"$error":"#DIV/0!"}},{"$f":"ROUND(1/360*事前相談チェックシート!$R$12*mkrain!$G29*事前相談チェックシート!$M$28,5)","v":{"$error":"#DIV/0!"}}]
["04:30:00",{"$f":"ROUND(1/360*事前相談チェックシート!$R$10*mkrain!$G30*事前相談チェックシート!$L$28,5)","v":{"$error":"#DIV/0!"}},{"$f":"ROUND(1/360*事前相談チェックシート!$R$12*mkrain!$G30*事前相談チェックシート!$M$28,5)","v":{"$error":"#DIV/0!"}}]
["04:40:00",{"$f":"ROUND(1/360*事前相談チェックシート!$R$10*mkrain!$G31*事前相談チェックシート!$L$28,5)","v":{"$error":"#DIV/0!"}},{"$f":"ROUND(1/360*事前相談チェックシート!$R$12*mkrain!$G31*事前相談チェックシート!$M$28,5)","v":{"$error":"#DIV/0!"}}]
["04:50:00",{"$f":"ROUND(1/360*事前相談チェックシート!$R$10*mkrain!$G32*事前相談チェックシート!$L$28,5)","v":{"$error":"#DIV/0!"}},{"$f":"ROUND(1/360*事前相談チェックシート!$R$12*mkrain!$G32*事前相談チェックシート!$M$28,5)","v":{"$error":"#DIV/0!"}}]
["05:00:00",{"$f":"ROUND(1/360*事前相談チェックシート!$R$10*mkrain!$G33*事前相談チェックシート!$L$28,5)","v":{"$error":"#DIV/0!"}},{"$f":"ROUND(1/360*事前相談チェックシート!$R$12*mkrain!$G33*事前相談チェックシート!$M$28,5)","v":{"$error":"#DIV/0!"}}]
["05:10:00",{"$f":"ROUND(1/360*事前相談チェックシート!$R$10*mkrain!$G34*事前相談チェックシート!$L$28,5)","v":{"$error":"#DIV/0!"}},{"$f":"ROUND(1/360*事前相談チェックシート!$R$12*mkrain!$G34*事前相談チェックシート!$M$28,5)","v":{"$error":"#DIV/0!"}}]
["05:20:00",{"$f":"ROUND(1/360*事前相談チェックシート!$R$10*mkrain!$G35*事前相談チェックシート!$L$28,5)","v":{"$error":"#DIV/0!"}},{"$f":"ROUND(1/360*事前相談チェックシート!$R$12*mkrain!$G35*事前相談チェックシート!$M$28,5)","v":{"$error":"#DIV/0!"}}]
["05:30:00",{"$f":"ROUND(1/360*事前相談チェックシート!$R$10*mkrain!$G36*事前相談チェックシート!$L$28,5)","v":{"$error":"#DIV/0!"}},{"$f":"ROUND(1/360*事前相談チェックシート!$R$12*mkrain!$G36*事前相談チェックシート!$M$28,5)","v":{"$error":"#DIV/0!"}}]
["05:40:00",{"$f":"ROUND(1/360*事前相談チェックシート!$R$10*mkrain!$G37*事前相談チェックシート!$L$28,5)","v":{"$error":"#DIV/0!"}},{"$f":"ROUND(1/360*事前相談チェックシート!$R$12*mkrain!$G37*事前相談チェックシート!$M$28,5)","v":{"$error":"#DIV/0!"}}]
["05:50:00",{"$f":"ROUND(1/360*事前相談チェックシート!$R$10*mkrain!$G38*事前相談チェックシート!$L$28,5)","v":{"$error":"#DIV/0!"}},{"$f":"ROUND(1/360*事前相談チェックシート!$R$12*mkrain!$G38*事前相談チェックシート!$M$28,5)","v":{"$error":"#DIV/0!"}}]
["06:00:00",{"$f":"ROUND(1/360*事前相談チェックシート!$R$10*mkrain!$G39*事前相談チェックシート!$L$28,5)","v":{"$error":"#DIV/0!"}},{"$f":"ROUND(1/360*事前相談チェックシート!$R$12*mkrain!$G39*事前相談チェックシート!$M$28,5)","v":{"$error":"#DIV/0!"}}]
["06:10:00",{"$f":"ROUND(1/360*事前相談チェックシート!$R$10*mkrain!$G40*事前相談チェックシート!$L$28,5)","v":{"$error":"#DIV/0!"}},{"$f":"ROUND(1/360*事前相談チェックシート!$R$12*mkrain!$G40*事前相談チェックシート!$M$28,5)","v":{"$error":"#DIV/0!"}}]
["06:20:00",{"$f":"ROUND(1/360*事前相談チェックシート!$R$10*mkrain!$G41*事前相談チェックシート!$L$28,5)","v":{"$error":"#DIV/0!"}},{"$f":"ROUND(1/360*事前相談チェックシート!$R$12*mkrain!$G41*事前相談チェックシート!$M$28,5)","v":{"$error":"#DIV/0!"}}]
["06:30:00",{"$f":"ROUND(1/360*事前相談チェックシート!$R$10*mkrain!$G42*事前相談チェックシート!$L$28,5)","v":{"$error":"#DIV/0!"}},{"$f":"ROUND(1/360*事前相談チェックシート!$R$12*mkrain!$G42*事前相談チェックシート!$M$28,5)","v":{"$error":"#DIV/0!"}}]
["06:40:00",{"$f":"ROUND(1/360*事前相談チェックシート!$R$10*mkrain!$G43*事前相談チェックシート!$L$28,5)","v":{"$error":"#DIV/0!"}},{"$f":"ROUND(1/360*事前相談チェックシート!$R$12*mkrain!$G43*事前相談チェックシート!$M$28,5)","v":{"$error":"#DIV/0!"}}]
["06:50:00",{"$f":"ROUND(1/360*事前相談チェックシート!$R$10*mkrain!$G44*事前相談チェックシート!$L$28,5)","v":{"$error":"#DIV/0!"}},{"$f":"ROUND(1/360*事前相談チェックシート!$R$12*mkrain!$G44*事前相談チェックシート!$M$28,5)","v":{"$error":"#DIV/0!"}}]
["07:00:00",{"$f":"ROUND(1/360*事前相談チェックシート!$R$10*mkrain!$G45*事前相談チェックシート!$L$28,5)","v":{"$error":"#DIV/0!"}},{"$f":"ROUND(1/360*事前相談チェックシート!$R$12*mkrain!$G45*事前相談チェックシート!$M$28,5)","v":{"$error":"#DIV/0!"}}]
["07:10:00",{"$f":"ROUND(1/360*事前相談チェックシート!$R$10*mkrain!$G46*事前相談チェックシート!$L$28,5)","v":{"$error":"#DIV/0!"}},{"$f":"ROUND(1/360*事前相談チェックシート!$R$12*mkrain!$G46*事前相談チェックシート!$M$28,5)","v":{"$error":"#DIV/0!"}}]
["07:20:00",{"$f":"ROUND(1/360*事前相談チェックシート!$R$10*mkrain!$G47*事前相談チェックシート!$L$28,5)","v":{"$error":"#DIV/0!"}},{"$f":"ROUND(1/360*事前相談チェックシート!$R$12*mkrain!$G47*事前相談チェックシート!$M$28,5)","v":{"$error":"#DIV/0!"}}]
["07:30:00",{"$f":"ROUND(1/360*事前相談チェックシート!$R$10*mkrain!$G48*事前相談チェックシート!$L$28,5)","v":{"$error":"#DIV/0!"}},{"$f":"ROUND(1/360*事前相談チェックシート!$R$12*mkrain!$G48*事前相談チェックシート!$M$28,5)","v":{"$error":"#DIV/0!"}}]
["07:40:00",{"$f":"ROUND(1/360*事前相談チェックシート!$R$10*mkrain!$G49*事前相談チェックシート!$L$28,5)","v":{"$error":"#DIV/0!"}},{"$f":"ROUND(1/360*事前相談チェックシート!$R$12*mkrain!$G49*事前相談チェックシート!$M$28,5)","v":{"$error":"#DIV/0!"}}]
["07:50:00",{"$f":"ROUND(1/360*事前相談チェックシート!$R$10*mkrain!$G50*事前相談チェックシート!$L$28,5)","v":{"$error":"#DIV/0!"}},{"$f":"ROUND(1/360*事前相談チェックシート!$R$12*mkrain!$G50*事前相談チェックシート!$M$28,5)","v":{"$error":"#DIV/0!"}}]
["08:00:00",{"$f":"ROUND(1/360*事前相談チェックシート!$R$10*mkrain!$G51*事前相談チェックシート!$L$28,5)","v":{"$error":"#DIV/0!"}},{"$f":"ROUND(1/360*事前相談チェックシート!$R$12*mkrain!$G51*事前相談チェックシート!$M$28,5)","v":{"$error":"#DIV/0!"}}]
["08:10:00",{"$f":"ROUND(1/360*事前相談チェックシート!$R$10*mkrain!$G52*事前相談チェックシート!$L$28,5)","v":{"$error":"#DIV/0!"}},{"$f":"ROUND(1/360*事前相談チェックシート!$R$12*mkrain!$G52*事前相談チェックシート!$M$28,5)","v":{"$error":"#DIV/0!"}}]
["08:20:00",{"$f":"ROUND(1/360*事前相談チェックシート!$R$10*mkrain!$G53*事前相談チェックシート!$L$28,5)","v":{"$error":"#DIV/0!"}},{"$f":"ROUND(1/360*事前相談チェックシート!$R$12*mkrain!$G53*事前相談チェックシート!$M$28,5)","v":{"$error":"#DIV/0!"}}]
["08:30:00",{"$f":"ROUND(1/360*事前相談チェックシート!$R$10*mkrain!$G54*事前相談チェックシート!$L$28,5)","v":{"$error":"#DIV/0!"}},{"$f":"ROUND(1/360*事前相談チェックシート!$R$12*mkrain!$G54*事前相談チェックシート!$M$28,5)","v":{"$error":"#DIV/0!"}}]
["08:40:00",{"$f":"ROUND(1/360*事前相談チェックシート!$R$10*mkrain!$G55*事前相談チェックシート!$L$28,5)","v":{"$error":"#DIV/0!"}},{"$f":"ROUND(1/360*事前相談チェックシート!$R$12*mkrain!$G55*事前相談チェックシート!$M$28,5)","v":{"$error":"#DIV/0!"}}]
["08:50:00",{"$f":"ROUND(1/360*事前相談チェックシート!$R$10*mkrain!$G56*事前相談チェックシート!$L$28,5)","v":{"$error":"#DIV/0!"}},{"$f":"ROUND(1/360*事前相談チェックシート!$R$12*mkrain!$G56*事前相談チェックシート!$M$28,5)","v":{"$error":"#DIV/0!"}}]
["09:00:00",{"$f":"ROUND(1/360*事前相談チェックシート!$R$10*mkrain!$G57*事前相談チェックシート!$L$28,5)","v":{"$error":"#DIV/0!"}},{"$f":"ROUND(1/360*事前相談チェックシート!$R$12*mkrain!$G57*事前相談チェックシート!$M$28,5)","v":{"$error":"#DIV/0!"}}]
["09:10:00",{"$f":"ROUND(1/360*事前相談チェックシート!$R$10*mkrain!$G58*事前相談チェックシート!$L$28,5)","v":{"$error":"#DIV/0!"}},{"$f":"ROUND(1/360*事前相談チェックシート!$R$12*mkrain!$G58*事前相談チェックシート!$M$28,5)","v":{"$error":"#DIV/0!"}}]
["09:20:00",{"$f":"ROUND(1/360*事前相談チェックシート!$R$10*mkrain!$G59*事前相談チェックシート!$L$28,5)","v":{"$error":"#DIV/0!"}},{"$f":"ROUND(1/360*事前相談チェックシート!$R$12*mkrain!$G59*事前相談チェックシート!$M$28,5)","v":{"$error":"#DIV/0!"}}]
["09:30:00",{"$f":"ROUND(1/360*事前相談チェックシート!$R$10*mkrain!$G60*事前相談チェックシート!$L$28,5)","v":{"$error":"#DIV/0!"}},{"$f":"ROUND(1/360*事前相談チェックシート!$R$12*mkrain!$G60*事前相談チェックシート!$M$28,5)","v":{"$error":"#DIV/0!"}}]
["09:40:00",{"$f":"ROUND(1/360*事前相談チェックシート!$R$10*mkrain!$G61*事前相談チェックシート!$L$28,5)","v":{"$error":"#DIV/0!"}},{"$f":"ROUND(1/360*事前相談チェックシート!$R$12*mkrain!$G61*事前相談チェックシート!$M$28,5)","v":{"$error":"#DIV/0!"}}]
["09:50:00",{"$f":"ROUND(1/360*事前相談チェックシート!$R$10*mkrain!$G62*事前相談チェックシート!$L$28,5)","v":{"$error":"#DIV/0!"}},{"$f":"ROUND(1/360*事前相談チェックシート!$R$12*mkrain!$G62*事前相談チェックシート!$M$28,5)","v":{"$error":"#DIV/0!"}}]
["10:00:00",{"$f":"ROUND(1/360*事前相談チェックシート!$R$10*mkrain!$G63*事前相談チェックシート!$L$28,5)","v":{"$error":"#DIV/0!"}},{"$f":"ROUND(1/360*事前相談チェックシート!$R$12*mkrain!$G63*事前相談チェックシート!$M$28,5)","v":{"$error":"#DIV/0!"}}]
["10:10:00",{"$f":"ROUND(1/360*事前相談チェックシート!$R$10*mkrain!$G64*事前相談チェックシート!$L$28,5)","v":{"$error":"#DIV/0!"}},{"$f":"ROUND(1/360*事前相談チェックシート!$R$12*mkrain!$G64*事前相談チェックシート!$M$28,5)","v":{"$error":"#DIV/0!"}}]
["10:20:00",{"$f":"ROUND(1/360*事前相談チェックシート!$R$10*mkrain!$G65*事前相談チェックシート!$L$28,5)","v":{"$error":"#DIV/0!"}},{"$f":"ROUND(1/360*事前相談チェックシート!$R$12*mkrain!$G65*事前相談チェックシート!$M$28,5)","v":{"$error":"#DIV/0!"}}]
["10:30:00",{"$f":"ROUND(1/360*事前相談チェックシート!$R$10*mkrain!$G66*事前相談チェックシート!$L$28,5)","v":{"$error":"#DIV/0!"}},{"$f":"ROUND(1/360*事前相談チェックシート!$R$12*mkrain!$G66*事前相談チェックシート!$M$28,5)","v":{"$error":"#DIV/0!"}}]
["10:40:00",{"$f":"ROUND(1/360*事前相談チェックシート!$R$10*mkrain!$G67*事前相談チェックシート!$L$28,5)","v":{"$error":"#DIV/0!"}},{"$f":"ROUND(1/360*事前相談チェックシート!$R$12*mkrain!$G67*事前相談チェックシート!$M$28,5)","v":{"$error":"#DIV/0!"}}]
["10:50:00",{"$f":"ROUND(1/360*事前相談チェックシート!$R$10*mkrain!$G68*事前相談チェックシート!$L$28,5)","v":{"$error":"#DIV/0!"}},{"$f":"ROUND(1/360*事前相談チェックシート!$R$12*mkrain!$G68*事前相談チェックシート!$M$28,5)","v":{"$error":"#DIV/0!"}}]
["11:00:00",{"$f":"ROUND(1/360*事前相談チェックシート!$R$10*mkrain!$G69*事前相談チェックシート!$L$28,5)","v":{"$error":"#DIV/0!"}},{"$f":"ROUND(1/360*事前相談チェックシート!$R$12*mkrain!$G69*事前相談チェックシート!$M$28,5)","v":{"$error":"#DIV/0!"}}]
["11:10:00",{"$f":"ROUND(1/360*事前相談チェックシート!$R$10*mkrain!$G70*事前相談チェックシート!$L$28,5)","v":{"$error":"#DIV/0!"}},{"$f":"ROUND(1/360*事前相談チェックシート!$R$12*mkrain!$G70*事前相談チェックシート!$M$28,5)","v":{"$error":"#DIV/0!"}}]
["11:20:00",{"$f":"ROUND(1/360*事前相談チェックシート!$R$10*mkrain!$G71*事前相談チェックシート!$L$28,5)","v":{"$error":"#DIV/0!"}},{"$f":"ROUND(1/360*事前相談チェックシート!$R$12*mkrain!$G71*事前相談チェックシート!$M$28,5)","v":{"$error":"#DIV/0!"}}]
["11:30:00",{"$f":"ROUND(1/360*事前相談チェックシート!$R$10*mkrain!$G72*事前相談チェックシート!$L$28,5)","v":{"$error":"#DIV/0!"}},{"$f":"ROUND(1/360*事前相談チェックシート!$R$12*mkrain!$G72*事前相談チェックシート!$M$28,5)","v":{"$error":"#DIV/0!"}}]
["11:40:00",{"$f":"ROUND(1/360*事前相談チェックシート!$R$10*mkrain!$G73*事前相談チェックシート!$L$28,5)","v":{"$error":"#DIV/0!"}},{"$f":"ROUND(1/360*事前相談チェックシート!$R$12*mkrain!$G73*事前相談チェックシート!$M$28,5)","v":{"$error":"#DIV/0!"}}]
["11:50:00",{"$f":"ROUND(1/360*事前相談チェックシート!$R$10*mkrain!$G74*事前相談チェックシート!$L$28,5)","v":{"$error":"#DIV/0!"}},{"$f":"ROUND(1/360*事前相談チェックシート!$R$12*mkrain!$G74*事前相談チェックシート!$M$28,5)","v":{"$error":"#DIV/0!"}}]
["12:00:00",{"$f":"ROUND(1/360*事前相談チェックシート!$R$10*mkrain!$G75*事前相談チェックシート!$L$28,5)","v":{"$error":"#DIV/0!"}},{"$f":"ROUND(1/360*事前相談チェックシート!$R$12*mkrain!$G75*事前相談チェックシート!$M$28,5)","v":{"$error":"#DIV/0!"}}]
["12:10:00",{"$f":"ROUND(1/360*事前相談チェックシート!$R$10*mkrain!$G76*事前相談チェックシート!$L$28,5)","v":{"$error":"#DIV/0!"}},{"$f":"ROUND(1/360*事前相談チェックシート!$R$12*mkrain!$G76*事前相談チェックシート!$M$28,5)","v":{"$error":"#DIV/0!"}}]
["12:20:00",{"$f":"ROUND(1/360*事前相談チェックシート!$R$10*mkrain!$G77*事前相談チェックシート!$L$28,5)","v":{"$error":"#DIV/0!"}},{"$f":"ROUND(1/360*事前相談チェックシート!$R$12*mkrain!$G77*事前相談チェックシート!$M$28,5)","v":{"$error":"#DIV/0!"}}]
["12:30:00",{"$f":"ROUND(1/360*事前相談チェックシート!$R$10*mkrain!$G78*事前相談チェックシート!$L$28,5)","v":{"$error":"#DIV/0!"}},{"$f":"ROUND(1/360*事前相談チェックシート!$R$12*mkrain!$G78*事前相談チェックシート!$M$28,5)","v":{"$error":"#DIV/0!"}}]
["12:40:00",{"$f":"ROUND(1/360*事前相談チェックシート!$R$10*mkrain!$G79*事前相談チェックシート!$L$28,5)","v":{"$error":"#DIV/0!"}},{"$f":"ROUND(1/360*事前相談チェックシート!$R$12*mkrain!$G79*事前相談チェックシート!$M$28,5)","v":{"$error":"#DIV/0!"}}]
["12:50:00",{"$f":"ROUND(1/360*事前相談チェックシート!$R$10*mkrain!$G80*事前相談チェックシート!$L$28,5)","v":{"$error":"#DIV/0!"}},{"$f":"ROUND(1/360*事前相談チェックシート!$R$12*mkrain!$G80*事前相談チェックシート!$M$28,5)","v":{"$error":"#DIV/0!"}}]
["13:00:00",{"$f":"ROUND(1/360*事前相談チェックシート!$R$10*mkrain!$G81*事前相談チェックシート!$L$28,5)","v":{"$error":"#DIV/0!"}},{"$f":"ROUND(1/360*事前相談チェックシート!$R$12*mkrain!$G81*事前相談チェックシート!$M$28,5)","v":{"$error":"#DIV/0!"}}]
["13:10:00",{"$f":"ROUND(1/360*事前相談チェックシート!$R$10*mkrain!$G82*事前相談チェックシート!$L$28,5)","v":{"$error":"#DIV/0!"}},{"$f":"ROUND(1/360*事前相談チェックシート!$R$12*mkrain!$G82*事前相談チェックシート!$M$28,5)","v":{"$error":"#DIV/0!"}}]
["13:20:00",{"$f":"ROUND(1/360*事前相談チェックシート!$R$10*mkrain!$G83*事前相談チェックシート!$L$28,5)","v":{"$error":"#DIV/0!"}},{"$f":"ROUND(1/360*事前相談チェックシート!$R$12*mkrain!$G83*事前相談チェックシート!$M$28,5)","v":{"$error":"#DIV/0!"}}]
["13:30:00",{"$f":"ROUND(1/360*事前相談チェックシート!$R$10*mkrain!$G84*事前相談チェックシート!$L$28,5)","v":{"$error":"#DIV/0!"}},{"$f":"ROUND(1/360*事前相談チェックシート!$R$12*mkrain!$G84*事前相談チェックシート!$M$28,5)","v":{"$error":"#DIV/0!"}}]
["13:40:00",{"$f":"ROUND(1/360*事前相談チェックシート!$R$10*mkrain!$G85*事前相談チェックシート!$L$28,5)","v":{"$error":"#DIV/0!"}},{"$f":"ROUND(1/360*事前相談チェックシート!$R$12*mkrain!$G85*事前相談チェックシート!$M$28,5)","v":{"$error":"#DIV/0!"}}]
["13:50:00",{"$f":"ROUND(1/360*事前相談チェックシート!$R$10*mkrain!$G86*事前相談チェックシート!$L$28,5)","v":{"$error":"#DIV/0!"}},{"$f":"ROUND(1/360*事前相談チェックシート!$R$12*mkrain!$G86*事前相談チェックシート!$M$28,5)","v":{"$error":"#DIV/0!"}}]
["14:00:00",{"$f":"ROUND(1/360*事前相談チェックシート!$R$10*mkrain!$G87*事前相談チェックシート!$L$28,5)","v":{"$error":"#DIV/0!"}},{"$f":"ROUND(1/360*事前相談チェックシート!$R$12*mkrain!$G87*事前相談チェックシート!$M$28,5)","v":{"$error":"#DIV/0!"}}]
["14:10:00",{"$f":"ROUND(1/360*事前相談チェックシート!$R$10*mkrain!$G88*事前相談チェックシート!$L$28,5)","v":{"$error":"#DIV/0!"}},{"$f":"ROUND(1/360*事前相談チェックシート!$R$12*mkrain!$G88*事前相談チェックシート!$M$28,5)","v":{"$error":"#DIV/0!"}}]
["14:20:00",{"$f":"ROUND(1/360*事前相談チェックシート!$R$10*mkrain!$G89*事前相談チェックシート!$L$28,5)","v":{"$error":"#DIV/0!"}},{"$f":"ROUND(1/360*事前相談チェックシート!$R$12*mkrain!$G89*事前相談チェックシート!$M$28,5)","v":{"$error":"#DIV/0!"}}]
["14:30:00",{"$f":"ROUND(1/360*事前相談チェックシート!$R$10*mkrain!$G90*事前相談チェックシート!$L$28,5)","v":{"$error":"#DIV/0!"}},{"$f":"ROUND(1/360*事前相談チェックシート!$R$12*mkrain!$G90*事前相談チェックシート!$M$28,5)","v":{"$error":"#DIV/0!"}}]
["14:40:00",{"$f":"ROUND(1/360*事前相談チェックシート!$R$10*mkrain!$G91*事前相談チェックシート!$L$28,5)","v":{"$error":"#DIV/0!"}},{"$f":"ROUND(1/360*事前相談チェックシート!$R$12*mkrain!$G91*事前相談チェックシート!$M$28,5)","v":{"$error":"#DIV/0!"}}]
["14:50:00",{"$f":"ROUND(1/360*事前相談チェックシート!$R$10*mkrain!$G92*事前相談チェックシート!$L$28,5)","v":{"$error":"#DIV/0!"}},{"$f":"ROUND(1/360*事前相談チェックシート!$R$12*mkrain!$G92*事前相談チェックシート!$M$28,5)","v":{"$error":"#DIV/0!"}}]
["15:00:00",{"$f":"ROUND(1/360*事前相談チェックシート!$R$10*mkrain!$G93*事前相談チェックシート!$L$28,5)","v":{"$error":"#DIV/0!"}},{"$f":"ROUND(1/360*事前相談チェックシート!$R$12*mkrain!$G93*事前相談チェックシート!$M$28,5)","v":{"$error":"#DIV/0!"}}]
["15:10:00",{"$f":"ROUND(1/360*事前相談チェックシート!$R$10*mkrain!$G94*事前相談チェックシート!$L$28,5)","v":{"$error":"#DIV/0!"}},{"$f":"ROUND(1/360*事前相談チェックシート!$R$12*mkrain!$G94*事前相談チェックシート!$M$28,5)","v":{"$error":"#DIV/0!"}}]
["15:20:00",{"$f":"ROUND(1/360*事前相談チェックシート!$R$10*mkrain!$G95*事前相談チェックシート!$L$28,5)","v":{"$error":"#DIV/0!"}},{"$f":"ROUND(1/360*事前相談チェックシート!$R$12*mkrain!$G95*事前相談チェックシート!$M$28,5)","v":{"$error":"#DIV/0!"}}]
["15:30:00",{"$f":"ROUND(1/360*事前相談チェックシート!$R$10*mkrain!$G96*事前相談チェックシート!$L$28,5)","v":{"$error":"#DIV/0!"}},{"$f":"ROUND(1/360*事前相談チェックシート!$R$12*mkrain!$G96*事前相談チェックシート!$M$28,5)","v":{"$error":"#DIV/0!"}}]
["15:40:00",{"$f":"ROUND(1/360*事前相談チェックシート!$R$10*mkrain!$G97*事前相談チェックシート!$L$28,5)","v":{"$error":"#DIV/0!"}},{"$f":"ROUND(1/360*事前相談チェックシート!$R$12*mkrain!$G97*事前相談チェックシート!$M$28,5)","v":{"$error":"#DIV/0!"}}]
["15:50:00",{"$f":"ROUND(1/360*事前相談チェックシート!$R$10*mkrain!$G98*事前相談チェックシート!$L$28,5)","v":{"$error":"#DIV/0!"}},{"$f":"ROUND(1/360*事前相談チェックシート!$R$12*mkrain!$G98*事前相談チェックシート!$M$28,5)","v":{"$error":"#DIV/0!"}}]
["16:00:00",{"$f":"ROUND(1/360*事前相談チェックシート!$R$10*mkrain!$G99*事前相談チェックシート!$L$28,5)","v":{"$error":"#DIV/0!"}},{"$f":"ROUND(1/360*事前相談チェックシート!$R$12*mkrain!$G99*事前相談チェックシート!$M$28,5)","v":{"$error":"#DIV/0!"}}]
["16:10:00",{"$f":"ROUND(1/360*事前相談チェックシート!$R$10*mkrain!$G100*事前相談チェックシート!$L$28,5)","v":{"$error":"#DIV/0!"}},{"$f":"ROUND(1/360*事前相談チェックシート!$R$12*mkrain!$G100*事前相談チェックシート!$M$28,5)","v":{"$error":"#DIV/0!"}}]
["16:20:00",{"$f":"ROUND(1/360*事前相談チェックシート!$R$10*mkrain!$G101*事前相談チェックシート!$L$28,5)","v":{"$error":"#DIV/0!"}},{"$f":"ROUND(1/360*事前相談チェックシート!$R$12*mkrain!$G101*事前相談チェックシート!$M$28,5)","v":{"$error":"#DIV/0!"}}]
["16:30:00",{"$f":"ROUND(1/360*事前相談チェックシート!$R$10*mkrain!$G102*事前相談チェックシート!$L$28,5)","v":{"$error":"#DIV/0!"}},{"$f":"ROUND(1/360*事前相談チェックシート!$R$12*mkrain!$G102*事前相談チェックシート!$M$28,5)","v":{"$error":"#DIV/0!"}}]
["16:40:00",{"$f":"ROUND(1/360*事前相談チェックシート!$R$10*mkrain!$G103*事前相談チェックシート!$L$28,5)","v":{"$error":"#DIV/0!"}},{"$f":"ROUND(1/360*事前相談チェックシート!$R$12*mkrain!$G103*事前相談チェックシート!$M$28,5)","v":{"$error":"#DIV/0!"}}]
["16:50:00",{"$f":"ROUND(1/360*事前相談チェックシート!$R$10*mkrain!$G104*事前相談チェックシート!$L$28,5)","v":{"$error":"#DIV/0!"}},{"$f":"ROUND(1/360*事前相談チェックシート!$R$12*mkrain!$G104*事前相談チェックシート!$M$28,5)","v":{"$error":"#DIV/0!"}}]
["17:00:00",{"$f":"ROUND(1/360*事前相談チェックシート!$R$10*mkrain!$G105*事前相談チェックシート!$L$28,5)","v":{"$error":"#DIV/0!"}},{"$f":"ROUND(1/360*事前相談チェックシート!$R$12*mkrain!$G105*事前相談チェックシート!$M$28,5)","v":{"$error":"#DIV/0!"}}]
["17:10:00",{"$f":"ROUND(1/360*事前相談チェックシート!$R$10*mkrain!$G106*事前相談チェックシート!$L$28,5)","v":{"$error":"#DIV/0!"}},{"$f":"ROUND(1/360*事前相談チェックシート!$R$12*mkrain!$G106*事前相談チェックシート!$M$28,5)","v":{"$error":"#DIV/0!"}}]
["17:20:00",{"$f":"ROUND(1/360*事前相談チェックシート!$R$10*mkrain!$G107*事前相談チェックシート!$L$28,5)","v":{"$error":"#DIV/0!"}},{"$f":"ROUND(1/360*事前相談チェックシート!$R$12*mkrain!$G107*事前相談チェックシート!$M$28,5)","v":{"$error":"#DIV/0!"}}]
["17:30:00",{"$f":"ROUND(1/360*事前相談チェックシート!$R$10*mkrain!$G108*事前相談チェックシート!$L$28,5)","v":{"$error":"#DIV/0!"}},{"$f":"ROUND(1/360*事前相談チェックシート!$R$12*mkrain!$G108*事前相談チェックシート!$M$28,5)","v":{"$error":"#DIV/0!"}}]
["17:40:00",{"$f":"ROUND(1/360*事前相談チェックシート!$R$10*mkrain!$G109*事前相談チェックシート!$L$28,5)","v":{"$error":"#DIV/0!"}},{"$f":"ROUND(1/360*事前相談チェックシート!$R$12*mkrain!$G109*事前相談チェックシート!$M$28,5)","v":{"$error":"#DIV/0!"}}]
["17:50:00",{"$f":"ROUND(1/360*事前相談チェックシート!$R$10*mkrain!$G110*事前相談チェックシート!$L$28,5)","v":{"$error":"#DIV/0!"}},{"$f":"ROUND(1/360*事前相談チェックシート!$R$12*mkrain!$G110*事前相談チェックシート!$M$28,5)","v":{"$error":"#DIV/0!"}}]
["18:00:00",{"$f":"ROUND(1/360*事前相談チェックシート!$R$10*mkrain!$G111*事前相談チェックシート!$L$28,5)","v":{"$error":"#DIV/0!"}},{"$f":"ROUND(1/360*事前相談チェックシート!$R$12*mkrain!$G111*事前相談チェックシート!$M$28,5)","v":{"$error":"#DIV/0!"}}]
["18:10:00",{"$f":"ROUND(1/360*事前相談チェックシート!$R$10*mkrain!$G112*事前相談チェックシート!$L$28,5)","v":{"$error":"#DIV/0!"}},{"$f":"ROUND(1/360*事前相談チェックシート!$R$12*mkrain!$G112*事前相談チェックシート!$M$28,5)","v":{"$error":"#DIV/0!"}}]
["18:20:00",{"$f":"ROUND(1/360*事前相談チェックシート!$R$10*mkrain!$G113*事前相談チェックシート!$L$28,5)","v":{"$error":"#DIV/0!"}},{"$f":"ROUND(1/360*事前相談チェックシート!$R$12*mkrain!$G113*事前相談チェックシート!$M$28,5)","v":{"$error":"#DIV/0!"}}]
["18:30:00",{"$f":"ROUND(1/360*事前相談チェックシート!$R$10*mkrain!$G114*事前相談チェックシート!$L$28,5)","v":{"$error":"#DIV/0!"}},{"$f":"ROUND(1/360*事前相談チェックシート!$R$12*mkrain!$G114*事前相談チェックシート!$M$28,5)","v":{"$error":"#DIV/0!"}}]
["18:40:00",{"$f":"ROUND(1/360*事前相談チェックシート!$R$10*mkrain!$G115*事前相談チェックシート!$L$28,5)","v":{"$error":"#DIV/0!"}},{"$f":"ROUND(1/360*事前相談チェックシート!$R$12*mkrain!$G115*事前相談チェックシート!$M$28,5)","v":{"$error":"#DIV/0!"}}]
["18:50:00",{"$f":"ROUND(1/360*事前相談チェックシート!$R$10*mkrain!$G116*事前相談チェックシート!$L$28,5)","v":{"$error":"#DIV/0!"}},{"$f":"ROUND(1/360*事前相談チェックシート!$R$12*mkrain!$G116*事前相談チェックシート!$M$28,5)","v":{"$error":"#DIV/0!"}}]
["19:00:00",{"$f":"ROUND(1/360*事前相談チェックシート!$R$10*mkrain!$G117*事前相談チェックシート!$L$28,5)","v":{"$error":"#DIV/0!"}},{"$f":"ROUND(1/360*事前相談チェックシート!$R$12*mkrain!$G117*事前相談チェックシート!$M$28,5)","v":{"$error":"#DIV/0!"}}]
["19:10:00",{"$f":"ROUND(1/360*事前相談チェックシート!$R$10*mkrain!$G118*事前相談チェックシート!$L$28,5)","v":{"$error":"#DIV/0!"}},{"$f":"ROUND(1/360*事前相談チェックシート!$R$12*mkrain!$G118*事前相談チェックシート!$M$28,5)","v":{"$error":"#DIV/0!"}}]
["19:20:00",{"$f":"ROUND(1/360*事前相談チェックシート!$R$10*mkrain!$G119*事前相談チェックシート!$L$28,5)","v":{"$error":"#DIV/0!"}},{"$f":"ROUND(1/360*事前相談チェックシート!$R$12*mkrain!$G119*事前相談チェックシート!$M$28,5)","v":{"$error":"#DIV/0!"}}]
["19:30:00",{"$f":"ROUND(1/360*事前相談チェックシート!$R$10*mkrain!$G120*事前相談チェックシート!$L$28,5)","v":{"$error":"#DIV/0!"}},{"$f":"ROUND(1/360*事前相談チェックシート!$R$12*mkrain!$G120*事前相談チェックシート!$M$28,5)","v":{"$error":"#DIV/0!"}}]
["19:40:00",{"$f":"ROUND(1/360*事前相談チェックシート!$R$10*mkrain!$G121*事前相談チェックシート!$L$28,5)","v":{"$error":"#DIV/0!"}},{"$f":"ROUND(1/360*事前相談チェックシート!$R$12*mkrain!$G121*事前相談チェックシート!$M$28,5)","v":{"$error":"#DIV/0!"}}]
["19:50:00",{"$f":"ROUND(1/360*事前相談チェックシート!$R$10*mkrain!$G122*事前相談チェックシート!$L$28,5)","v":{"$error":"#DIV/0!"}},{"$f":"ROUND(1/360*事前相談チェックシート!$R$12*mkrain!$G122*事前相談チェックシート!$M$28,5)","v":{"$error":"#DIV/0!"}}]
["20:00:00",{"$f":"ROUND(1/360*事前相談チェックシート!$R$10*mkrain!$G123*事前相談チェックシート!$L$28,5)","v":{"$error":"#DIV/0!"}},{"$f":"ROUND(1/360*事前相談チェックシート!$R$12*mkrain!$G123*事前相談チェックシート!$M$28,5)","v":{"$error":"#DIV/0!"}}]
["20:10:00",{"$f":"ROUND(1/360*事前相談チェックシート!$R$10*mkrain!$G124*事前相談チェックシート!$L$28,5)","v":{"$error":"#DIV/0!"}},{"$f":"ROUND(1/360*事前相談チェックシート!$R$12*mkrain!$G124*事前相談チェックシート!$M$28,5)","v":{"$error":"#DIV/0!"}}]
["20:20:00",{"$f":"ROUND(1/360*事前相談チェックシート!$R$10*mkrain!$G125*事前相談チェックシート!$L$28,5)","v":{"$error":"#DIV/0!"}},{"$f":"ROUND(1/360*事前相談チェックシート!$R$12*mkrain!$G125*事前相談チェックシート!$M$28,5)","v":{"$error":"#DIV/0!"}}]
["20:30:00",{"$f":"ROUND(1/360*事前相談チェックシート!$R$10*mkrain!$G126*事前相談チェックシート!$L$28,5)","v":{"$error":"#DIV/0!"}},{"$f":"ROUND(1/360*事前相談チェックシート!$R$12*mkrain!$G126*事前相談チェックシート!$M$28,5)","v":{"$error":"#DIV/0!"}}]
["20:40:00",{"$f":"ROUND(1/360*事前相談チェックシート!$R$10*mkrain!$G127*事前相談チェックシート!$L$28,5)","v":{"$error":"#DIV/0!"}},{"$f":"ROUND(1/360*事前相談チェックシート!$R$12*mkrain!$G127*事前相談チェックシート!$M$28,5)","v":{"$error":"#DIV/0!"}}]
["20:50:00",{"$f":"ROUND(1/360*事前相談チェックシート!$R$10*mkrain!$G128*事前相談チェックシート!$L$28,5)","v":{"$error":"#DIV/0!"}},{"$f":"ROUND(1/360*事前相談チェックシート!$R$12*mkrain!$G128*事前相談チェックシート!$M$28,5)","v":{"$error":"#DIV/0!"}}]
["21:00:00",{"$f":"ROUND(1/360*事前相談チェックシート!$R$10*mkrain!$G129*事前相談チェックシート!$L$28,5)","v":{"$error":"#DIV/0!"}},{"$f":"ROUND(1/360*事前相談チェックシート!$R$12*mkrain!$G129*事前相談チェックシート!$M$28,5)","v":{"$error":"#DIV/0!"}}]
["21:10:00",{"$f":"ROUND(1/360*事前相談チェックシート!$R$10*mkrain!$G130*事前相談チェックシート!$L$28,5)","v":{"$error":"#DIV/0!"}},{"$f":"ROUND(1/360*事前相談チェックシート!$R$12*mkrain!$G130*事前相談チェックシート!$M$28,5)","v":{"$error":"#DIV/0!"}}]
["21:20:00",{"$f":"ROUND(1/360*事前相談チェックシート!$R$10*mkrain!$G131*事前相談チェックシート!$L$28,5)","v":{"$error":"#DIV/0!"}},{"$f":"ROUND(1/360*事前相談チェックシート!$R$12*mkrain!$G131*事前相談チェックシート!$M$28,5)","v":{"$error":"#DIV/0!"}}]
["21:30:00",{"$f":"ROUND(1/360*事前相談チェックシート!$R$10*mkrain!$G132*事前相談チェックシート!$L$28,5)","v":{"$error":"#DIV/0!"}},{"$f":"ROUND(1/360*事前相談チェックシート!$R$12*mkrain!$G132*事前相談チェックシート!$M$28,5)","v":{"$error":"#DIV/0!"}}]
["21:40:00",{"$f":"ROUND(1/360*事前相談チェックシート!$R$10*mkrain!$G133*事前相談チェックシート!$L$28,5)","v":{"$error":"#DIV/0!"}},{"$f":"ROUND(1/360*事前相談チェックシート!$R$12*mkrain!$G133*事前相談チェックシート!$M$28,5)","v":{"$error":"#DIV/0!"}}]
["21:50:00",{"$f":"ROUND(1/360*事前相談チェックシート!$R$10*mkrain!$G134*事前相談チェックシート!$L$28,5)","v":{"$error":"#DIV/0!"}},{"$f":"ROUND(1/360*事前相談チェックシート!$R$12*mkrain!$G134*事前相談チェックシート!$M$28,5)","v":{"$error":"#DIV/0!"}}]
["22:00:00",{"$f":"ROUND(1/360*事前相談チェックシート!$R$10*mkrain!$G135*事前相談チェックシート!$L$28,5)","v":{"$error":"#DIV/0!"}},{"$f":"ROUND(1/360*事前相談チェックシート!$R$12*mkrain!$G135*事前相談チェックシート!$M$28,5)","v":{"$error":"#DIV/0!"}}]
["22:10:00",{"$f":"ROUND(1/360*事前相談チェックシート!$R$10*mkrain!$G136*事前相談チェックシート!$L$28,5)","v":{"$error":"#DIV/0!"}},{"$f":"ROUND(1/360*事前相談チェックシート!$R$12*mkrain!$G136*事前相談チェックシート!$M$28,5)","v":{"$error":"#DIV/0!"}}]
["22:20:00",{"$f":"ROUND(1/360*事前相談チェックシート!$R$10*mkrain!$G137*事前相談チェックシート!$L$28,5)","v":{"$error":"#DIV/0!"}},{"$f":"ROUND(1/360*事前相談チェックシート!$R$12*mkrain!$G137*事前相談チェックシート!$M$28,5)","v":{"$error":"#DIV/0!"}}]
["22:30:00",{"$f":"ROUND(1/360*事前相談チェックシート!$R$10*mkrain!$G138*事前相談チェックシート!$L$28,5)","v":{"$error":"#DIV/0!"}},{"$f":"ROUND(1/360*事前相談チェックシート!$R$12*mkrain!$G138*事前相談チェックシート!$M$28,5)","v":{"$error":"#DIV/0!"}}]
["22:40:00",{"$f":"ROUND(1/360*事前相談チェックシート!$R$10*mkrain!$G139*事前相談チェックシート!$L$28,5)","v":{"$error":"#DIV/0!"}},{"$f":"ROUND(1/360*事前相談チェックシート!$R$12*mkrain!$G139*事前相談チェックシート!$M$28,5)","v":{"$error":"#DIV/0!"}}]
["22:50:00",{"$f":"ROUND(1/360*事前相談チェックシート!$R$10*mkrain!$G140*事前相談チェックシート!$L$28,5)","v":{"$error":"#DIV/0!"}},{"$f":"ROUND(1/360*事前相談チェックシート!$R$12*mkrain!$G140*事前相談チェックシート!$M$28,5)","v":{"$error":"#DIV/0!"}}]
["23:00:00",{"$f":"ROUND(1/360*事前相談チェックシート!$R$10*mkrain!$G141*事前相談チェックシート!$L$28,5)","v":{"$error":"#DIV/0!"}},{"$f":"ROUND(1/360*事前相談チェックシート!$R$12*mkrain!$G141*事前相談チェックシート!$M$28,5)","v":{"$error":"#DIV/0!"}}]
["23:10:00",{"$f":"ROUND(1/360*事前相談チェックシート!$R$10*mkrain!$G142*事前相談チェックシート!$L$28,5)","v":{"$error":"#DIV/0!"}},{"$f":"ROUND(1/360*事前相談チェックシート!$R$12*mkrain!$G142*事前相談チェックシート!$M$28,5)","v":{"$error":"#DIV/0!"}}]
["23:20:00",{"$f":"ROUND(1/360*事前相談チェックシート!$R$10*mkrain!$G143*事前相談チェックシート!$L$28,5)","v":{"$error":"#DIV/0!"}},{"$f":"ROUND(1/360*事前相談チェックシート!$R$12*mkrain!$G143*事前相談チェックシート!$M$28,5)","v":{"$error":"#DIV/0!"}}]
["23:30:00",{"$f":"ROUND(1/360*事前相談チェックシート!$R$10*mkrain!$G144*事前相談チェックシート!$L$28,5)","v":{"$error":"#DIV/0!"}},{"$f":"ROUND(1/360*事前相談チェックシート!$R$12*mkrain!$G144*事前相談チェックシート!$M$28,5)","v":{"$error":"#DIV/0!"}}]
["23:40:00",{"$f":"ROUND(1/360*事前相談チェックシート!$R$10*mkrain!$G145*事前相談チェックシート!$L$28,5)","v":{"$error":"#DIV/0!"}},{"$f":"ROUND(1/360*事前相談チェックシート!$R$12*mkrain!$G145*事前相談チェックシート!$M$28,5)","v":{"$error":"#DIV/0!"}}]
["23:50:00",{"$f":"ROUND(1/360*事前相談チェックシート!$R$10*mkrain!$G146*事前相談チェックシート!$L$28,5)","v":{"$error":"#DIV/0!"}},{"$f":"ROUND(1/360*事前相談チェックシート!$R$12*mkrain!$G146*事前相談チェックシート!$M$28,5)","v":{"$error":"#DIV/0!"}}]
[1,{"$f":"ROUND(1/360*事前相談チェックシート!$R$10*mkrain!$G147*事前相談チェックシート!$L$28,5)","v":{"$error":"#DIV/0!"}},{"$f":"ROUND(1/360*事前相談チェックシート!$R$12*mkrain!$G147*事前相談チェックシート!$M$28,5)","v":{"$error":"#DIV/0!"}}]

{"sheet":"逐次計算（概算）","index":16,"n_rows":147,"n_cols":5,"rows_kept":147,"cut":false,"hidden":true,"merged":[]}
["時刻","行為後流入量","許容放流量","調整池水位","調節後放流量"]
[]
[{"$f":"runoff!A4","v":"00:00:00"},{"$f":"runoff!C4","v":0},{"$f":"runoff!$B$1","v":{"$error":"#DIV/0!"}},0,0]
[{"$f":"runoff!A5","v":"00:10:00"},{"$f":"runoff!C5","v":{"$error":"#DIV/0!"}},{"$f":"runoff!$B$1","v":{"$error":"#DIV/0!"}},3.1529374724926628E-4,3.0153431841110898E-6]
[{"$f":"runoff!A6","v":"00:20:00"},{"$f":"runoff!C6","v":{"$error":"#DIV/0!"}},{"$f":"runoff!$B$1","v":{"$error":"#DIV/0!"}},9.4532963762935488E-4,1.6131263333779928E-5]
[{"$f":"runoff!A7","v":"00:30:00"},{"$f":"runoff!C7","v":{"$error":"#DIV/0!"}},{"$f":"runoff!$B$1","v":{"$error":"#DIV/0!"}},1.5740494297300251E-3,3.4309235605831888E-5]
[{"$f":"runoff!A8","v":"00:40:00"},{"$f":"runoff!C8","v":{"$error":"#DIV/0!"}},{"$f":"runoff!$B$1","v":{"$error":"#DIV/0!"}},2.2010693540432738E-3,5.655034183469629E-5]
[{"$f":"runoff!A9","v":"00:50:00"},{"$f":"runoff!C9","v":{"$error":"#DIV/0!"}},{"$f":"runoff!$B$1","v":{"$error":"#DIV/0!"}},2.8365548888863801E-3,8.3015829673665711E-5]
[{"$f":"runoff!A10","v":"01:00:00"},{"$f":"runoff!C10","v":{"$error":"#DIV/0!"}},{"$f":"runoff!$B$1","v":{"$error":"#DIV/0!"}},3.4801944283836977E-3,1.1266623116789614E-4]
[{"$f":"runoff!A11","v":"01:10:00"},{"$f":"runoff!C11","v":{"$error":"#DIV/0!"}},{"$f":"runoff!$B$1","v":{"$error":"#DIV/0!"}},4.1212191601763433E-3,1.4519014620699007E-4]
[{"$f":"runoff!A12","v":"01:20:00"},{"$f":"runoff!C12","v":{"$error":"#DIV/0!"}},{"$f":"runoff!$B$1","v":{"$error":"#DIV/0!"}},4.769867469244393E-3,1.8139450484161028E-4]
[{"$f":"runoff!A13","v":"01:30:00"},{"$f":"runoff!C13","v":{"$error":"#DIV/0!"}},{"$f":"runoff!$B$1","v":{"$error":"#DIV/0!"}},5.4259223179810943E-3,2.1907909186348601E-4]
[{"$f":"runoff!A14","v":"01:40:00"},{"$f":"runoff!C14","v":{"$error":"#DIV/0!"}},{"$f":"runoff!$B$1","v":{"$error":"#DIV/0!"}},6.0786613243761891E-3,2.6023786718648313E-4]
[{"$f":"runoff!A15","v":"01:50:00"},{"$f":"runoff!C15","v":{"$error":"#DIV/0!"}},{"$f":"runoff!$B$1","v":{"$error":"#DIV/0!"}},6.7383558114491654E-3,3.0369321796719655E-4]
[{"$f":"runoff!A16","v":"02:00:00"},{"$f":"runoff!C16","v":{"$error":"#DIV/0!"}},{"$f":"runoff!$B$1","v":{"$error":"#DIV/0!"}},7.4048174677412565E-3,3.4932962130975527E-4]
[{"$f":"runoff!A17","v":"02:10:00"},{"$f":"runoff!C17","v":{"$error":"#DIV/0!"}},{"$f":"runoff!$B$1","v":{"$error":"#DIV/0!"}},8.0778100731500619E-3,3.984017611919801E-4]
[{"$f":"runoff!A18","v":"02:20:00"},{"$f":"runoff!C18","v":{"$error":"#DIV/0!"}},{"$f":"runoff!$B$1","v":{"$error":"#DIV/0!"}},8.7571006370032855E-3,4.4957816496470917E-4]
[{"$f":"runoff!A19","v":"02:30:00"},{"$f":"runoff!C19","v":{"$error":"#DIV/0!"}},{"$f":"runoff!$B$1","v":{"$error":"#DIV/0!"}},9.4320016461078762E-3,5.0277561854834482E-4]
[{"$f":"runoff!A20","v":"02:40:00"},{"$f":"runoff!C20","v":{"$error":"#DIV/0!"}},{"$f":"runoff!$B$1","v":{"$error":"#DIV/0!"}},1.0112860238781296E-2,5.5792006677259835E-4]
[{"$f":"runoff!A21","v":"02:50:00"},{"$f":"runoff!C21","v":{"$error":"#DIV/0!"}},{"$f":"runoff!$B$1","v":{"$error":"#DIV/0!"}},1.0799449553422647E-2,6.1651178508857415E-4]
[{"$f":"runoff!A22","v":"03:00:00"},{"$f":"runoff!C22","v":{"$error":"#DIV/0!"}},{"$f":"runoff!$B$1","v":{"$error":"#DIV/0!"}},1.1491543923695249E-2,6.770220773184779E-4]
[{"$f":"runoff!A23","v":"03:10:00"},{"$f":"runoff!C23","v":{"$error":"#DIV/0!"}},{"$f":"runoff!$B$1","v":{"$error":"#DIV/0!"}},1.218898445588581E-2,7.3939193503926525E-4]
[{"$f":"runoff!A24","v":"03:20:00"},{"$f":"runoff!C24","v":{"$error":"#DIV/0!"}},{"$f":"runoff!$B$1","v":{"$error":"#DIV/0!"}},1.2891617003743217E-2,8.0356748257351331E-4]
[{"$f":"runoff!A25","v":"03:30:00"},{"$f":"runoff!C25","v":{"$error":"#DIV/0!"}},{"$f":"runoff!$B$1","v":{"$error":"#DIV/0!"}},1.3599217817472973E-2,8.7125761318557671E-4]
[{"$f":"runoff!A26","v":"03:40:00"},{"$f":"runoff!C26","v":{"$error":"#DIV/0!"}},{"$f":"runoff!$B$1","v":{"$error":"#DIV/0!"}},1.4311563358368806E-2,9.4074841440241607E-4]
[{"$f":"runoff!A27","v":"03:50:00"},{"$f":"runoff!C27","v":{"$error":"#DIV/0!"}},{"$f":"runoff!$B$1","v":{"$error":"#DIV/0!"}},1.5028504081930428E-2,1.0119943809101233E-3]
[{"$f":"runoff!A28","v":"04:00:00"},{"$f":"runoff!C28","v":{"$error":"#DIV/0!"}},{"$f":"runoff!$B$1","v":{"$error":"#DIV/0!"}},1.5749894133030285E-2,1.084953292937752E-3]
[{"$f":"runoff!A29","v":"04:10:00"},{"$f":"runoff!C29","v":{"$error":"#DIV/0!"}},{"$f":"runoff!$B$1","v":{"$error":"#DIV/0!"}},1.6475509693014662E-2,1.1615211696559137E-3]
[{"$f":"runoff!A30","v":"04:20:00"},{"$f":"runoff!C30","v":{"$error":"#DIV/0!"}},{"$f":"runoff!$B$1","v":{"$error":"#DIV/0!"}},1.7205126605134895E-2,1.2398100310407716E-3]
[{"$f":"runoff!A31","v":"04:30:00"},{"$f":"runoff!C31","v":{"$error":"#DIV/0!"}},{"$f":"runoff!$B$1","v":{"$error":"#DIV/0!"}},1.7938601671095431E-2,1.3197828450087431E-3]
[{"$f":"runoff!A32","v":"04:40:00"},{"$f":"runoff!C32","v":{"$error":"#DIV/0!"}},{"$f":"runoff!$B$1","v":{"$error":"#DIV/0!"}},1.8675794711025085E-2,1.4014048722194713E-3]
[{"$f":"runoff!A33","v":"04:50:00"},{"$f":"runoff!C33","v":{"$error":"#DIV/0!"}},{"$f":"runoff!$B$1","v":{"$error":"#DIV/0!"}},1.9426994021993917E-2,1.486744844743859E-3]
[{"$f":"runoff!A34","v":"05:00:00"},{"$f":"runoff!C34","v":{"$error":"#DIV/0!"}},{"$f":"runoff!$B$1","v":{"$error":"#DIV/0!"}},2.0181459189930119E-2,1.5737500509953751E-3]
[{"$f":"runoff!A35","v":"05:10:00"},{"$f":"runoff!C35","v":{"$error":"#DIV/0!"}},{"$f":"runoff!$B$1","v":{"$error":"#DIV/0!"}},2.0938959693907924E-2,1.664571298865702E-3]
[{"$f":"runoff!A36","v":"05:20:00"},{"$f":"runoff!C36","v":{"$error":"#DIV/0!"}},{"$f":"runoff!$B$1","v":{"$error":"#DIV/0!"}},2.1709778290595543E-2,1.7570754021175165E-3]
[{"$f":"runoff!A37","v":"05:30:00"},{"$f":"runoff!C37","v":{"$error":"#DIV/0!"}},{"$f":"runoff!$B$1","v":{"$error":"#DIV/0!"}},2.2483260677591582E-2,1.8512322848656024E-3]
[{"$f":"runoff!A38","v":"05:40:00"},{"$f":"runoff!C38","v":{"$error":"#DIV/0!"}},{"$f":"runoff!$B$1","v":{"$error":"#DIV/0!"}},2.3259269035440486E-2,1.9470134285048311E-3]
[{"$f":"runoff!A39","v":"05:50:00"},{"$f":"runoff!C39","v":{"$error":"#DIV/0!"}},{"$f":"runoff!$B$1","v":{"$error":"#DIV/0!"}},2.4048083584115823E-2,2.0467295252149446E-3]
[{"$f":"runoff!A40","v":"06:00:00"},{"$f":"runoff!C40","v":{"$error":"#DIV/0!"}},{"$f":"runoff!$B$1","v":{"$error":"#DIV/0!"}},2.484936963775107E-2,2.1504687550135937E-3]
[{"$f":"runoff!A41","v":"06:10:00"},{"$f":"runoff!C41","v":{"$error":"#DIV/0!"}},{"$f":"runoff!$B$1","v":{"$error":"#DIV/0!"}},2.566288668145858E-2,2.2559037612745235E-3]
[{"$f":"runoff!A42","v":"06:20:00"},{"$f":"runoff!C42","v":{"$error":"#DIV/0!"}},{"$f":"runoff!$B$1","v":{"$error":"#DIV/0!"}},2.648828681475841E-2,2.3679152913739666E-3]
[{"$f":"runoff!A43","v":"06:30:00"},{"$f":"runoff!C43","v":{"$error":"#DIV/0!"}},{"$f":"runoff!$B$1","v":{"$error":"#DIV/0!"}},2.7325322812867245E-2,2.4792287535936931E-3]
[{"$f":"runoff!A44","v":"06:40:00"},{"$f":"runoff!C44","v":{"$error":"#DIV/0!"}},{"$f":"runoff!$B$1","v":{"$error":"#DIV/0!"}},2.8173740034236533E-2,2.5972950938477116E-3]
[{"$f":"runoff!A45","v":"06:50:00"},{"$f":"runoff!C45","v":{"$error":"#DIV/0!"}},{"$f":"runoff!$B$1","v":{"$error":"#DIV/0!"}},2.9033178068461958E-2,2.7171783145699328E-3]
[{"$f":"runoff!A46","v":"07:00:00"},{"$f":"runoff!C46","v":{"$error":"#DIV/0!"}},{"$f":"runoff!$B$1","v":{"$error":"#DIV/0!"}},2.990348523478396E-2,2.8388512862180118E-3]
[{"$f":"runoff!A47","v":"07:10:00"},{"$f":"runoff!C47","v":{"$error":"#DIV/0!"}},{"$f":"runoff!$B$1","v":{"$error":"#DIV/0!"}},3.0784400834064737E-2,2.9649333531057425E-3]
[{"$f":"runoff!A48","v":"07:20:00"},{"$f":"runoff!C48","v":{"$error":"#DIV/0!"}},{"$f":"runoff!$B$1","v":{"$error":"#DIV/0!"}},3.167555032011337E-2,3.0955122008489099E-3]
[{"$f":"runoff!A49","v":"07:30:00"},{"$f":"runoff!C49","v":{"$error":"#DIV/0!"}},{"$f":"runoff!$B$1","v":{"$error":"#DIV/0!"}},3.2587065781040071E-2,3.2306757282273306E-3]
[{"$f":"runoff!A50","v":"07:40:00"},{"$f":"runoff!C50","v":{"$error":"#DIV/0!"}},{"$f":"runoff!$B$1","v":{"$error":"#DIV/0!"}},3.351855788456478E-2,3.3705120324074118E-3]
[{"$f":"runoff!A51","v":"07:50:00"},{"$f":"runoff!C51","v":{"$error":"#DIV/0!"}},{"$f":"runoff!$B$1","v":{"$error":"#DIV/0!"}},3.4469629880595772E-2,3.5151093953001587E-3]
[{"$f":"runoff!A52","v":"08:00:00"},{"$f":"runoff!C52","v":{"$error":"#DIV/0!"}},{"$f":"runoff!$B$1","v":{"$error":"#DIV/0!"}},3.5450391604911854E-2,3.6645562709618196E-3]
[{"$f":"runoff!A53","v":"08:10:00"},{"$f":"runoff!C53","v":{"$error":"#DIV/0!"}},{"$f":"runoff!$B$1","v":{"$error":"#DIV/0!"}},3.6449796331317459E-2,3.821820234504952E-3]
[{"$f":"runoff!A54","v":"08:20:00"},{"$f":"runoff!C54","v":{"$error":"#DIV/0!"}},{"$f":"runoff!$B$1","v":{"$error":"#DIV/0!"}},3.7467423308863337E-2,3.9812716327375505E-3]
[{"$f":"runoff!A55","v":"08:30:00"},{"$f":"runoff!C55","v":{"$error":"#DIV/0!"}},{"$f":"runoff!$B$1","v":{"$error":"#DIV/0!"}},3.8513354966099117E-2,4.1487978507671859E-3]
[{"$f":"runoff!A56","v":"08:40:00"},{"$f":"runoff!C56","v":{"$error":"#DIV/0!"}},{"$f":"runoff!$B$1","v":{"$error":"#DIV/0!"}},3.9597291072410321E-2,4.327610288055379E-3]
[{"$f":"runoff!A57","v":"08:50:00"},{"$f":"runoff!C57","v":{"$error":"#DIV/0!"}},{"$f":"runoff!$B$1","v":{"$error":"#DIV/0!"}},4.0718523967059314E-2,4.5119631058463446E-3]
[{"$f":"runoff!A58","v":"09:00:00"},{"$f":"runoff!C58","v":{"$error":"#DIV/0!"}},{"$f":"runoff!$B$1","v":{"$error":"#DIV/0!"}},4.1876454065389916E-2,4.7050323338482802E-3]
[{"$f":"runoff!A59","v":"09:10:00"},{"$f":"runoff!C59","v":{"$error":"#DIV/0!"}},{"$f":"runoff!$B$1","v":{"$error":"#DIV/0!"}},4.3080721386459478E-2,4.9101669207200415E-3]
[{"$f":"runoff!A60","v":"09:20:00"},{"$f":"runoff!C60","v":{"$error":"#DIV/0!"}},{"$f":"runoff!$B$1","v":{"$error":"#DIV/0!"}},4.4330429645301053E-2,5.1245478134912892E-3]
[{"$f":"runoff!A61","v":"09:30:00"},{"$f":"runoff!C61","v":{"$error":"#DIV/0!"}},{"$f":"runoff!$B$1","v":{"$error":"#DIV/0!"}},4.5635170171317678E-2,5.3516219012245793E-3]
[{"$f":"runoff!A62","v":"09:40:00"},{"$f":"runoff!C62","v":{"$error":"#DIV/0!"}},{"$f":"runoff!$B$1","v":{"$error":"#DIV/0!"}},4.7004236348899386E-2,5.5950267651658746E-3]
[{"$f":"runoff!A63","v":"09:50:00"},{"$f":"runoff!C63","v":{"$error":"#DIV/0!"}},{"$f":"runoff!$B$1","v":{"$error":"#DIV/0!"}},4.8436372118582892E-2,5.8519671556929121E-3]
[{"$f":"runoff!A64","v":"10:00:00"},{"$f":"runoff!C64","v":{"$error":"#DIV/0!"}},{"$f":"runoff!$B$1","v":{"$error":"#DIV/0!"}},4.9940795053731127E-2,6.1261986085600481E-3]
[{"$f":"runoff!A65","v":"10:10:00"},{"$f":"runoff!C65","v":{"$error":"#DIV/0!"}},{"$f":"runoff!$B$1","v":{"$error":"#DIV/0!"}},5.153676780924852E-2,6.425115871359772E-3]
[{"$f":"runoff!A66","v":"10:20:00"},{"$f":"runoff!C66","v":{"$error":"#DIV/0!"}},{"$f":"runoff!$B$1","v":{"$error":"#DIV/0!"}},5.324335075514354E-2,6.7461340818030114E-3]
[{"$f":"runoff!A67","v":"10:30:00"},{"$f":"runoff!C67","v":{"$error":"#DIV/0!"}},{"$f":"runoff!$B$1","v":{"$error":"#DIV/0!"}},5.5079383524235984E-2,7.0970867419988155E-3]
[{"$f":"runoff!A68","v":"10:40:00"},{"$f":"runoff!C68","v":{"$error":"#DIV/0!"}},{"$f":"runoff!$B$1","v":{"$error":"#DIV/0!"}},5.7073539183592675E-2,7.4863231355198354E-3]
[{"$f":"runoff!A69","v":"10:50:00"},{"$f":"runoff!C69","v":{"$error":"#DIV/0!"}},{"$f":"runoff!$B$1","v":{"$error":"#DIV/0!"}},5.9264277976462082E-2,7.9227766784743525E-3]
[{"$f":"runoff!A70","v":"11:00:00"},{"$f":"runoff!C70","v":{"$error":"#DIV/0!"}},{"$f":"runoff!$B$1","v":{"$error":"#DIV/0!"}},6.1710308703725278E-2,8.4160482510450777E-3]
[{"$f":"runoff!A71","v":"11:10:00"},{"$f":"runoff!C71","v":{"$error":"#DIV/0!"}},{"$f":"runoff!$B$1","v":{"$error":"#DIV/0!"}},6.4489884522328317E-2,8.9918156177270538E-3]
[{"$f":"runoff!A72","v":"11:20:00"},{"$f":"runoff!C72","v":{"$error":"#DIV/0!"}},{"$f":"runoff!$B$1","v":{"$error":"#DIV/0!"}},6.7721221565613166E-2,9.6741702419444898E-3]
[{"$f":"runoff!A73","v":"11:30:00"},{"$f":"runoff!C73","v":{"$error":"#DIV/0!"}},{"$f":"runoff!$B$1","v":{"$error":"#DIV/0!"}},7.1624019908745853E-2,1.0525958043566952E-2]
[{"$f":"runoff!A74","v":"11:40:00"},{"$f":"runoff!C74","v":{"$error":"#DIV/0!"}},{"$f":"runoff!$B$1","v":{"$error":"#DIV/0!"}},7.6663132255508387E-2,1.1655148377857366E-2]
[{"$f":"runoff!A75","v":"11:50:00"},{"$f":"runoff!C75","v":{"$error":"#DIV/0!"}},{"$f":"runoff!$B$1","v":{"$error":"#DIV/0!"}},8.4094609104088572E-2,1.339084655590252E-2]
[{"$f":"runoff!A76","v":"12:00:00"},{"$f":"runoff!C76","v":{"$error":"#DIV/0!"}},{"$f":"runoff!$B$1","v":{"$error":"#DIV/0!"}},0.10596043462623651,1.8938413250802057E-2]
[{"$f":"runoff!A77","v":"12:10:00"},{"$f":"runoff!C77","v":{"$error":"#DIV/0!"}},{"$f":"runoff!$B$1","v":{"$error":"#DIV/0!"}},0.12954173064824881,2.5600770225794739E-2]
[{"$f":"runoff!A78","v":"12:20:00"},{"$f":"runoff!C78","v":{"$error":"#DIV/0!"}},{"$f":"runoff!$B$1","v":{"$error":"#DIV/0!"}},0.13863862978925762,2.8345183532440234E-2]
[{"$f":"runoff!A79","v":"12:30:00"},{"$f":"runoff!C79","v":{"$error":"#DIV/0!"}},{"$f":"runoff!$B$1","v":{"$error":"#DIV/0!"}},0.14314565952440397,2.9737664987412721E-2]
[{"$f":"runoff!A80","v":"12:40:00"},{"$f":"runoff!C80","v":{"$error":"#DIV/0!"}},{"$f":"runoff!$B$1","v":{"$error":"#DIV/0!"}},0.14588647475894889,3.0591839435630253E-2]
[{"$f":"runoff!A81","v":"12:50:00"},{"$f":"runoff!C81","v":{"$error":"#DIV/0!"}},{"$f":"runoff!$B$1","v":{"$error":"#DIV/0!"}},0.14764280898050364,3.1146435740734973E-2]
[{"$f":"runoff!A82","v":"13:00:00"},{"$f":"runoff!C82","v":{"$error":"#DIV/0!"}},{"$f":"runoff!$B$1","v":{"$error":"#DIV/0!"}},0.14875111301080832,3.1500557316465422E-2]
[{"$f":"runoff!A83","v":"13:10:00"},{"$f":"runoff!C83","v":{"$error":"#DIV/0!"}},{"$f":"runoff!$B$1","v":{"$error":"#DIV/0!"}},0.14939436484439034,3.1704343529473072E-2]
[{"$f":"runoff!A84","v":"13:20:00"},{"$f":"runoff!C84","v":{"$error":"#DIV/0!"}},{"$f":"runoff!$B$1","v":{"$error":"#DIV/0!"}},0.14969894221891131,3.1803483343028016E-2]
[{"$f":"runoff!A85","v":"13:30:00"},{"$f":"runoff!C85","v":{"$error":"#DIV/0!"}},{"$f":"runoff!$B$1","v":{"$error":"#DIV/0!"}},0.14974652290686741,3.1815153632237782E-2]
[{"$f":"runoff!A86","v":"13:40:00"},{"$f":"runoff!C86","v":{"$error":"#DIV/0!"}},{"$f":"runoff!$B$1","v":{"$error":"#DIV/0!"}},0.1495855405711794,3.1762648571899248E-2]
[{"$f":"runoff!A87","v":"13:50:00"},{"$f":"runoff!C87","v":{"$error":"#DIV/0!"}},{"$f":"runoff!$B$1","v":{"$error":"#DIV/0!"}},0.14926270973748021,3.1663551251615095E-2]
[{"$f":"runoff!A88","v":"14:00:00"},{"$f":"runoff!C88","v":{"$error":"#DIV/0!"}},{"$f":"runoff!$B$1","v":{"$error":"#DIV/0!"}},0.14880297128374331,3.1518007537240426E-2]
[{"$f":"runoff!A89","v":"14:10:00"},{"$f":"runoff!C89","v":{"$error":"#DIV/0!"}},{"$f":"runoff!$B$1","v":{"$error":"#DIV/0!"}},0.14823100675041095,3.133203803310685E-2]
[{"$f":"runoff!A90","v":"14:20:00"},{"$f":"runoff!C90","v":{"$error":"#DIV/0!"}},{"$f":"runoff!$B$1","v":{"$error":"#DIV/0!"}},0.14757050350701034,3.1123261309974417E-2]
[{"$f":"runoff!A91","v":"14:30:00"},{"$f":"runoff!C91","v":{"$error":"#DIV/0!"}},{"$f":"runoff!$B$1","v":{"$error":"#DIV/0!"}},0.14683388736952666,3.089183351463758E-2]
[{"$f":"runoff!A92","v":"14:40:00"},{"$f":"runoff!C92","v":{"$error":"#DIV/0!"}},{"$f":"runoff!$B$1","v":{"$error":"#DIV/0!"}},0.1460335702615296,3.0637928831070273E-2]
[{"$f":"runoff!A93","v":"14:50:00"},{"$f":"runoff!C93","v":{"$error":"#DIV/0!"}},{"$f":"runoff!$B$1","v":{"$error":"#DIV/0!"}},0.1451711930384825,3.0367485139160742E-2]
[{"$f":"runoff!A94","v":"15:00:00"},{"$f":"runoff!C94","v":{"$error":"#DIV/0!"}},{"$f":"runoff!$B$1","v":{"$error":"#DIV/0!"}},0.14425865431381527,3.008065786959303E-2]
[{"$f":"runoff!A95","v":"15:10:00"},{"$f":"runoff!C95","v":{"$error":"#DIV/0!"}},{"$f":"runoff!$B$1","v":{"$error":"#DIV/0!"}},0.14330759910324695,2.9783321581698233E-2]
[{"$f":"runoff!A96","v":"15:20:00"},{"$f":"runoff!C96","v":{"$error":"#DIV/0!"}},{"$f":"runoff!$B$1","v":{"$error":"#DIV/0!"}},0.1423291811899384,2.948128213474981E-2]
[{"$f":"runoff!A97","v":"15:30:00"},{"$f":"runoff!C97","v":{"$error":"#DIV/0!"}},{"$f":"runoff!$B$1","v":{"$error":"#DIV/0!"}},0.14132403200090515,2.9168931915595928E-2]
[{"$f":"runoff!A98","v":"15:40:00"},{"$f":"runoff!C98","v":{"$error":"#DIV/0!"}},{"$f":"runoff!$B$1","v":{"$error":"#DIV/0!"}},0.14029277600149753,2.8852044070319108E-2]
[{"$f":"runoff!A99","v":"15:50:00"},{"$f":"runoff!C99","v":{"$error":"#DIV/0!"}},{"$f":"runoff!$B$1","v":{"$error":"#DIV/0!"}},0.13924630610352426,2.8530684614822825E-2]
[{"$f":"runoff!A100","v":"16:00:00"},{"$f":"runoff!C100","v":{"$error":"#DIV/0!"}},{"$f":"runoff!$B$1","v":{"$error":"#DIV/0!"}},0.13818499557945466,2.8204921179721003E-2]
[{"$f":"runoff!A101","v":"16:10:00"},{"$f":"runoff!C101","v":{"$error":"#DIV/0!"}},{"$f":"runoff!$B$1","v":{"$error":"#DIV/0!"}},0.13711949111799734,2.7880407126042044E-2]
[{"$f":"runoff!A102","v":"16:20:00"},{"$f":"runoff!C102","v":{"$error":"#DIV/0!"}},{"$f":"runoff!$B$1","v":{"$error":"#DIV/0!"}},0.13604992136139485,2.7551584864283694E-2]
[{"$f":"runoff!A103","v":"16:30:00"},{"$f":"runoff!C103","v":{"$error":"#DIV/0!"}},{"$f":"runoff!$B$1","v":{"$error":"#DIV/0!"}},0.13497617969508682,2.7229605867929375E-2]
[{"$f":"runoff!A104","v":"16:40:00"},{"$f":"runoff!C104","v":{"$error":"#DIV/0!"}},{"$f":"runoff!$B$1","v":{"$error":"#DIV/0!"}},0.13389815723852713,2.6903372543601423E-2]
[{"$f":"runoff!A105","v":"16:50:00"},{"$f":"runoff!C105","v":{"$error":"#DIV/0!"}},{"$f":"runoff!$B$1","v":{"$error":"#DIV/0!"}},0.13281620880788314,2.6572956807266818E-2]
[{"$f":"runoff!A106","v":"17:00:00"},{"$f":"runoff!C106","v":{"$error":"#DIV/0!"}},{"$f":"runoff!$B$1","v":{"$error":"#DIV/0!"}},0.13174050659798264,2.625485129481182E-2]
[{"$f":"runoff!A107","v":"17:10:00"},{"$f":"runoff!C107","v":{"$error":"#DIV/0!"}},{"$f":"runoff!$B$1","v":{"$error":"#DIV/0!"}},0.13066019431517314,2.593257409643614E-2]
[{"$f":"runoff!A108","v":"17:20:00"},{"$f":"runoff!C108","v":{"$error":"#DIV/0!"}},{"$f":"runoff!$B$1","v":{"$error":"#DIV/0!"}},0.12957539148873981,2.5611626443200707E-2]
[{"$f":"runoff!A109","v":"17:30:00"},{"$f":"runoff!C109","v":{"$error":"#DIV/0!"}},{"$f":"runoff!$B$1","v":{"$error":"#DIV/0!"}},0.12849650007387456,2.5292013865817715E-2]
[{"$f":"runoff!A110","v":"17:40:00"},{"$f":"runoff!C110","v":{"$error":"#DIV/0!"}},{"$f":"runoff!$B$1","v":{"$error":"#DIV/0!"}},0.12742340753895043,2.4973741964600293E-2]
[{"$f":"runoff!A111","v":"17:50:00"},{"$f":"runoff!C111","v":{"$error":"#DIV/0!"}},{"$f":"runoff!$B$1","v":{"$error":"#DIV/0!"}},0.12635577544210472,2.4662176782619942E-2]
[{"$f":"runoff!A112","v":"18:00:00"},{"$f":"runoff!C112","v":{"$error":"#DIV/0!"}},{"$f":"runoff!$B$1","v":{"$error":"#DIV/0!"}},0.12529326677662586,2.4351918152099635E-2]
[{"$f":"runoff!A113","v":"18:10:00"},{"$f":"runoff!C113","v":{"$error":"#DIV/0!"}},{"$f":"runoff!$B$1","v":{"$error":"#DIV/0!"}},0.12423577141328296,2.4042971598498757E-2]
[{"$f":"runoff!A114","v":"18:20:00"},{"$f":"runoff!C114","v":{"$error":"#DIV/0!"}},{"$f":"runoff!$B$1","v":{"$error":"#DIV/0!"}},0.12319347018146565,2.3740635469157157E-2]
[{"$f":"runoff!A115","v":"18:30:00"},{"$f":"runoff!C115","v":{"$error":"#DIV/0!"}},{"$f":"runoff!$B$1","v":{"$error":"#DIV/0!"}},0.12216580966074195,2.344484802360652E-2]
[{"$f":"runoff!A116","v":"18:40:00"},{"$f":"runoff!C116","v":{"$error":"#DIV/0!"}},{"$f":"runoff!$B$1","v":{"$error":"#DIV/0!"}},0.12114194832461306,2.3150299302124869E-2]
[{"$f":"runoff!A117","v":"18:50:00"},{"$f":"runoff!C117","v":{"$error":"#DIV/0!"}},{"$f":"runoff!$B$1","v":{"$error":"#DIV/0!"}},0.12012178176131723,2.2856994536242452E-2]
[{"$f":"runoff!A118","v":"19:00:00"},{"$f":"runoff!C118","v":{"$error":"#DIV/0!"}},{"$f":"runoff!$B$1","v":{"$error":"#DIV/0!"}},0.11911550026288069,2.2570143315471018E-2]
[{"$f":"runoff!A119","v":"19:10:00"},{"$f":"runoff!C119","v":{"$error":"#DIV/0!"}},{"$f":"runoff!$B$1","v":{"$error":"#DIV/0!"}},0.11812256356401545,2.2289684857547044E-2]
[{"$f":"runoff!A120","v":"19:20:00"},{"$f":"runoff!C120","v":{"$error":"#DIV/0!"}},{"$f":"runoff!$B$1","v":{"$error":"#DIV/0!"}},0.11713213952756368,2.2010397786972478E-2]
[{"$f":"runoff!A121","v":"19:30:00"},{"$f":"runoff!C121","v":{"$error":"#DIV/0!"}},{"$f":"runoff!$B$1","v":{"$error":"#DIV/0!"}},0.11615442729049925,2.1737426516559587E-2]
[{"$f":"runoff!A122","v":"19:40:00"},{"$f":"runoff!C122","v":{"$error":"#DIV/0!"}},{"$f":"runoff!$B$1","v":{"$error":"#DIV/0!"}},0.1151891133802687,2.1465593126700253E-2]
[{"$f":"runoff!A123","v":"19:50:00"},{"$f":"runoff!C123","v":{"$error":"#DIV/0!"}},{"$f":"runoff!$B$1","v":{"$error":"#DIV/0!"}},0.11422558786743847,2.1194902400596165E-2]
[{"$f":"runoff!A124","v":"20:00:00"},{"$f":"runoff!C124","v":{"$error":"#DIV/0!"}},{"$f":"runoff!$B$1","v":{"$error":"#DIV/0!"}},0.11327405501755446,2.0930434252201494E-2]
[{"$f":"runoff!A125","v":"20:10:00"},{"$f":"runoff!C125","v":{"$error":"#DIV/0!"}},{"$f":"runoff!$B$1","v":{"$error":"#DIV/0!"}},0.11233399392705401,2.0672129455253756E-2]
[{"$f":"runoff!A126","v":"20:20:00"},{"$f":"runoff!C126","v":{"$error":"#DIV/0!"}},{"$f":"runoff!$B$1","v":{"$error":"#DIV/0!"}},0.11140510032986646,2.0414896077872436E-2]
[{"$f":"runoff!A127","v":"20:30:00"},{"$f":"runoff!C127","v":{"$error":"#DIV/0!"}},{"$f":"runoff!$B$1","v":{"$error":"#DIV/0!"}},0.11048707311937615,2.0163750927119493E-2]
[{"$f":"runoff!A128","v":"20:40:00"},{"$f":"runoff!C128","v":{"$error":"#DIV/0!"}},{"$f":"runoff!$B$1","v":{"$error":"#DIV/0!"}},0.10957961257772433,1.9913644174379429E-2]
[{"$f":"runoff!A129","v":"20:50:00"},{"$f":"runoff!C129","v":{"$error":"#DIV/0!"}},{"$f":"runoff!$B$1","v":{"$error":"#DIV/0!"}},0.10868221303902167,1.9674522634772727E-2]
[{"$f":"runoff!A130","v":"21:00:00"},{"$f":"runoff!C130","v":{"$error":"#DIV/0!"}},{"$f":"runoff!$B$1","v":{"$error":"#DIV/0!"}},0.10779458016296778,1.9431414640286172E-2]
[{"$f":"runoff!A131","v":"21:10:00"},{"$f":"runoff!C131","v":{"$error":"#DIV/0!"}},{"$f":"runoff!$B$1","v":{"$error":"#DIV/0!"}},0.10691663177790682,1.9194246960052286E-2]
[{"$f":"runoff!A132","v":"21:20:00"},{"$f":"runoff!C132","v":{"$error":"#DIV/0!"}},{"$f":"runoff!$B$1","v":{"$error":"#DIV/0!"}},0.1060478706158917,1.8962962892307315E-2]
[{"$f":"runoff!A133","v":"21:30:00"},{"$f":"runoff!C133","v":{"$error":"#DIV/0!"}},{"$f":"runoff!$B$1","v":{"$error":"#DIV/0!"}},0.10519852386844657,1.8732615324721317E-2]
[{"$f":"runoff!A134","v":"21:40:00"},{"$f":"runoff!C134","v":{"$error":"#DIV/0!"}},{"$f":"runoff!$B$1","v":{"$error":"#DIV/0!"}},0.10435779372200574,1.8508079268427478E-2]
[{"$f":"runoff!A135","v":"21:50:00"},{"$f":"runoff!C135","v":{"$error":"#DIV/0!"}},{"$f":"runoff!$B$1","v":{"$error":"#DIV/0!"}},0.1035251936806974,1.8289299491570911E-2]
[{"$f":"runoff!A136","v":"22:00:00"},{"$f":"runoff!C136","v":{"$error":"#DIV/0!"}},{"$f":"runoff!$B$1","v":{"$error":"#DIV/0!"}},0.10270044511517044,1.8071388622069983E-2]
[{"$f":"runoff!A137","v":"22:10:00"},{"$f":"runoff!C137","v":{"$error":"#DIV/0!"}},{"$f":"runoff!$B$1","v":{"$error":"#DIV/0!"}},0.10188347479346166,1.7854350138561133E-2]
[{"$f":"runoff!A138","v":"22:20:00"},{"$f":"runoff!C138","v":{"$error":"#DIV/0!"}},{"$f":"runoff!$B$1","v":{"$error":"#DIV/0!"}},0.10108431995002294,1.7647776138759765E-2]
[{"$f":"runoff!A139","v":"22:30:00"},{"$f":"runoff!C139","v":{"$error":"#DIV/0!"}},{"$f":"runoff!$B$1","v":{"$error":"#DIV/0!"}},0.10029219355604334,1.7437229229199668E-2]
[{"$f":"runoff!A140","v":"22:40:00"},{"$f":"runoff!C140","v":{"$error":"#DIV/0!"}},{"$f":"runoff!$B$1","v":{"$error":"#DIV/0!"}},9.9507027156796254E-2,1.7232282930675483E-2]
[{"$f":"runoff!A141","v":"22:50:00"},{"$f":"runoff!C141","v":{"$error":"#DIV/0!"}},{"$f":"runoff!$B$1","v":{"$error":"#DIV/0!"}},9.8738865927478159E-2,1.7032884077554707E-2]
[{"$f":"runoff!A142","v":"23:00:00"},{"$f":"runoff!C142","v":{"$error":"#DIV/0!"}},{"$f":"runoff!$B$1","v":{"$error":"#DIV/0!"}},9.7976731439385609E-2,1.6838980417090529E-2]
[{"$f":"runoff!A143","v":"23:10:00"},{"$f":"runoff!C143","v":{"$error":"#DIV/0!"}},{"$f":"runoff!$B$1","v":{"$error":"#DIV/0!"}},9.7220559151319774E-2,1.6641116210252747E-2]
[{"$f":"runoff!A144","v":"23:20:00"},{"$f":"runoff!C144","v":{"$error":"#DIV/0!"}},{"$f":"runoff!$B$1","v":{"$error":"#DIV/0!"}},9.6480602850519931E-2,1.6453400275432017E-2]
[{"$f":"runoff!A145","v":"23:30:00"},{"$f":"runoff!C145","v":{"$error":"#DIV/0!"}},{"$f":"runoff!$B$1","v":{"$error":"#DIV/0!"}},9.5745891812193534E-2,1.626639552477354E-2]
[{"$f":"runoff!A146","v":"23:40:00"},{"$f":"runoff!C146","v":{"$error":"#DIV/0!"}},{"$f":"runoff!$B$1","v":{"$error":"#DIV/0!"}},9.5016366102929253E-2,1.608010467328817E-2]
[{"$f":"runoff!A147","v":"23:50:00"},{"$f":"runoff!C147","v":{"$error":"#DIV/0!"}},{"$f":"runoff!$B$1","v":{"$error":"#DIV/0!"}},9.4302284833514563E-2,1.5899161066127751E-2]
[{"$f":"runoff!A148","v":1},{"$f":"runoff!C148","v":{"$error":"#DIV/0!"}},{"$f":"runoff!$B$1","v":{"$error":"#DIV/0!"}},9.3592880341704418E-2,1.5718901294691501E-2]

{"sheet":"浸透計算","index":17,"n_rows":149,"n_cols":7,"rows_kept":149,"cut":false,"hidden":true,"merged":[]}
[8,9,10]
[null,{"$f":"MAX(B5:B149)","v":0.43075000000000002},{"$f":"MAX(C5:C149)","v":0.43075000000000002}]
[]
["時刻","浸透考慮前","浸透考慮後","許容放流量"]
["00:00:00",0,0,{"$f":"事前相談チェックシート!U25","v":99999},null,null,0]
["00:10:00",7.4999999999999997E-3,7.4999999999999997E-3,{"$f":"D5","v":99999},null,null,{"$f":"G5+1/6","v":0.16666666666666666}]
["00:20:00",7.4999999999999997E-3,7.4999999999999997E-3,{"$f":"D6","v":99999},null,null,{"$f":"G6+1/6","v":0.33333333333333331}]
["00:30:00",7.4999999999999997E-3,7.4999999999999997E-3,99999,null,null,0.5]
["00:40:00",7.4999999999999997E-3,7.4999999999999997E-3,99999,null,null,0.66666666666666663]
["00:50:00",7.7499999999999999E-3,7.7499999999999999E-3,99999,null,null,0.83333333333333326]
["01:00:00",7.7499999999999999E-3,7.7499999999999999E-3,99999,null,null,0.99999999999999989]
["01:10:00",7.7499999999999999E-3,7.7499999999999999E-3,99999,null,null,1.1666666666666665]
["01:20:00",8.0000000000000002E-3,8.0000000000000002E-3,99999,null,null,1.3333333333333333]
["01:30:00",8.0000000000000002E-3,8.0000000000000002E-3,99999,null,null,1.5]
["01:40:00",8.0000000000000002E-3,8.0000000000000002E-3,99999,null,null,1.6666666666666667]
["01:50:00",8.2500000000000004E-3,8.2500000000000004E-3,99999,null,null,1.8333333333333335]
["02:00:00",8.2500000000000004E-3,8.2500000000000004E-3,99999,null,null,2]
["02:10:00",8.5000000000000006E-3,8.5000000000000006E-3,99999,null,null,2.1666666666666665]
["02:20:00",8.5000000000000006E-3,8.5000000000000006E-3,99999,null,null,2.333333333333333]
["02:30:00",8.5000000000000006E-3,8.5000000000000006E-3,99999,null,null,2.4999999999999996]
["02:40:00",8.7500000000000008E-3,8.7500000000000008E-3,99999,null,null,2.6666666666666661]
["02:50:00",8.7500000000000008E-3,8.7500000000000008E-3,99999,null,null,2.8333333333333326]
["03:00:00",8.9999999999999993E-3,8.9999999999999993E-3,99999,null,null,2.9999999999999991]
["03:10:00",8.9999999999999993E-3,8.9999999999999993E-3,99999,null,null,3.1666666666666656]
["03:20:00",9.2499999999999995E-3,9.2499999999999995E-3,99999,null,null,3.3333333333333321]
["03:30:00",9.2499999999999995E-3,9.2499999999999995E-3,99999,null,null,3.4999999999999987]
["03:40:00",9.4999999999999998E-3,9.4999999999999998E-3,99999,null,null,3.6666666666666652]
["03:50:00",9.4999999999999998E-3,9.4999999999999998E-3,99999,null,null,3.8333333333333317]
["04:00:00",9.75E-3,9.75E-3,99999,null,null,3.9999999999999982]
["04:10:00",9.75E-3,9.75E-3,99999,null,null,4.1666666666666652]
["04:20:00",0.01,0.01,99999,null,null,4.3333333333333321]
["04:30:00",0.01,0.01,99999,null,null,4.4999999999999991]
["04:40:00",1.025E-2,1.025E-2,99999,null,null,4.6666666666666661]
["04:50:00",1.0500000000000001E-2,1.0500000000000001E-2,99999,null,null,4.833333333333333]
["05:00:00",1.0500000000000001E-2,1.0500000000000001E-2,99999,null,null,5]
["05:10:00",1.0749999999999999E-2,1.0749999999999999E-2,99999,null,null,5.166666666666667]
["05:20:00",1.0999999999999999E-2,1.0999999999999999E-2,99999,null,null,5.3333333333333339]
["05:30:00",1.0999999999999999E-2,1.0999999999999999E-2,99999,null,null,5.5000000000000009]
["05:40:00",1.125E-2,1.125E-2,99999,null,null,5.6666666666666679]
["05:50:00",1.15E-2,1.15E-2,99999,null,null,5.8333333333333348]
["06:00:00",1.175E-2,1.175E-2,99999,null,null,6.0000000000000018]
["06:10:00",1.2E-2,1.2E-2,99999,null,null,6.1666666666666687]
["06:20:00",1.225E-2,1.225E-2,99999,null,null,6.3333333333333357]
["06:30:00",1.2500000000000001E-2,1.2500000000000001E-2,99999,null,null,6.5000000000000027]
["06:40:00",1.2749999999999999E-2,1.2749999999999999E-2,99999,null,null,6.6666666666666696]
["06:50:00",1.2999999999999999E-2,1.2999999999999999E-2,99999,null,null,6.8333333333333366]
["07:00:00",1.325E-2,1.325E-2,99999,null,null,7.0000000000000036]
["07:10:00",1.35E-2,1.35E-2,99999,null,null,7.1666666666666705]
["07:20:00",1.375E-2,1.375E-2,99999,null,null,7.3333333333333375]
["07:30:00",1.4250000000000001E-2,1.4250000000000001E-2,99999,null,null,7.5000000000000044]
["07:40:00",1.4500000000000001E-2,1.4500000000000001E-2,99999,null,null,7.6666666666666714]
["07:50:00",1.4999999999999999E-2,1.4999999999999999E-2,99999,null,null,7.8333333333333384]
["08:00:00",1.55E-2,1.55E-2,99999,null,null,8.0000000000000053]
["08:10:00",1.575E-2,1.575E-2,99999,null,null,8.1666666666666714]
["08:20:00",1.6250000000000001E-2,1.6250000000000001E-2,99999,null,null,8.3333333333333375]
["08:30:00",1.6750000000000001E-2,1.6750000000000001E-2,99999,null,null,8.5000000000000036]
["08:40:00",1.7500000000000002E-2,1.7500000000000002E-2,99999,null,null,8.6666666666666696]
["08:50:00",1.7999999999999999E-2,1.7999999999999999E-2,99999,null,null,8.8333333333333357]
["09:00:00",1.8749999999999999E-2,1.8749999999999999E-2,99999,null,null,9.0000000000000018]
["09:10:00",1.95E-2,1.95E-2,99999,null,null,9.1666666666666679]
["09:20:00",2.0250000000000001E-2,2.0250000000000001E-2,99999,null,null,9.3333333333333339]
["09:30:00",2.1250000000000002E-2,2.1250000000000002E-2,99999,null,null,9.5]
["09:40:00",2.2249999999999999E-2,2.2249999999999999E-2,99999,null,null,9.6666666666666661]
["09:50:00",2.325E-2,2.325E-2,99999,null,null,9.8333333333333321]
["10:00:00",2.4500000000000001E-2,2.4500000000000001E-2,99999,null,null,9.9999999999999982]
["10:10:00",2.5999999999999999E-2,2.5999999999999999E-2,99999,null,null,10.166666666666664]
["10:20:00",2.775E-2,2.775E-2,99999,null,null,10.33333333333333]
["10:30:00",2.9749999999999999E-2,2.9749999999999999E-2,99999,null,null,10.499999999999996]
["10:40:00",3.2250000000000001E-2,3.2250000000000001E-2,99999,null,null,10.666666666666663]
["10:50:00",3.5249999999999997E-2,3.5249999999999997E-2,99999,null,null,10.833333333333329]
["11:00:00",3.925E-2,3.925E-2,{"$f":"D70","v":99999},null,null,{"$f":"G70+1/6","v":10.999999999999995}]
["11:10:00",4.4249999999999998E-2,4.4249999999999998E-2,99999,null,null,11.166666666666661]
["11:20:00",5.1249999999999997E-2,5.1249999999999997E-2,99999,null,null,11.333333333333327]
["11:30:00",6.1749999999999999E-2,6.1749999999999999E-2,99999,null,null,11.499999999999993]
["11:40:00",8.0250000000000002E-2,8.0250000000000002E-2,99999,null,null,11.666666666666659]
["11:50:00",0.1215,0.1215,99999,null,null,11.833333333333325]
["12:00:00",0.43075000000000002,0.43075000000000002,99999,null,null,11.999999999999991]
["12:10:00",0.17449999999999999,0.17449999999999999,99999,null,null,12.166666666666657]
["12:20:00",9.5750000000000002E-2,9.5750000000000002E-2,99999,null,null,12.333333333333323]
["12:30:00",6.9500000000000006E-2,6.9500000000000006E-2,99999,null,null,12.499999999999989]
["12:40:00",5.6000000000000001E-2,5.6000000000000001E-2,99999,null,null,12.666666666666655]
["12:50:00",4.7500000000000001E-2,4.7500000000000001E-2,99999,null,null,12.833333333333321]
["13:00:00",4.1500000000000002E-2,4.1500000000000002E-2,99999,null,null,12.999999999999988]
["13:10:00",3.6999999999999998E-2,3.6999999999999998E-2,99999,null,null,13.166666666666654]
["13:20:00",3.3750000000000002E-2,3.3750000000000002E-2,99999,null,null,13.33333333333332]
["13:30:00",3.1E-2,3.1E-2,99999,null,null,13.499999999999986]
["13:40:00",2.8750000000000001E-2,2.8750000000000001E-2,99999,null,null,13.666666666666652]
["13:50:00",2.7E-2,2.7E-2,99999,null,null,13.833333333333318]
["14:00:00",2.5250000000000002E-2,2.5250000000000002E-2,99999,null,null,13.999999999999984]
["14:10:00",2.4E-2,2.4E-2,99999,null,null,14.16666666666665]
["14:20:00",2.2749999999999999E-2,2.2749999999999999E-2,99999,null,null,14.333333333333316]
["14:30:00",2.1749999999999999E-2,2.1749999999999999E-2,99999,null,null,14.499999999999982]
["14:40:00",2.0750000000000001E-2,2.0750000000000001E-2,99999,null,null,14.666666666666648]
["14:50:00",1.975E-2,1.975E-2,99999,null,null,14.833333333333314]
["15:00:00",1.9E-2,1.9E-2,99999,null,null,14.99999999999998]
["15:10:00",1.8249999999999999E-2,1.8249999999999999E-2,99999,null,null,15.166666666666647]
["15:20:00",1.7749999999999998E-2,1.7749999999999998E-2,99999,null,null,15.333333333333313]
["15:30:00",1.7000000000000001E-2,1.7000000000000001E-2,99999,null,null,15.499999999999979]
["15:40:00",1.6500000000000001E-2,1.6500000000000001E-2,99999,null,null,15.666666666666645]
["15:50:00",1.6E-2,1.6E-2,99999,null,null,15.833333333333311]
["16:00:00",1.55E-2,1.55E-2,99999,null,null,15.999999999999977]
["16:10:00",1.525E-2,1.525E-2,99999,null,null,16.166666666666643]
["16:20:00",1.4749999999999999E-2,1.4749999999999999E-2,99999,null,null,16.333333333333311]
["16:30:00",1.4500000000000001E-2,1.4500000000000001E-2,99999,null,null,16.499999999999979]
["16:40:00",1.4E-2,1.4E-2,99999,null,null,16.666666666666647]
["16:50:00",1.375E-2,1.375E-2,99999,null,null,16.833333333333314]
["17:00:00",1.35E-2,1.35E-2,99999,null,null,16.999999999999982]
["17:10:00",1.2999999999999999E-2,1.2999999999999999E-2,99999,null,null,17.16666666666665]
["17:20:00",1.2749999999999999E-2,1.2749999999999999E-2,99999,null,null,17.333333333333318]
["17:30:00",1.2500000000000001E-2,1.2500000000000001E-2,99999,null,null,17.499999999999986]
["17:40:00",1.225E-2,1.225E-2,99999,null,null,17.666666666666654]
["17:50:00",1.2E-2,1.2E-2,99999,null,null,17.833333333333321]
["18:00:00",1.175E-2,1.175E-2,99999,null,null,17.999999999999989]
["18:10:00",1.15E-2,1.15E-2,99999,null,null,18.166666666666657]
["18:20:00",1.15E-2,1.15E-2,99999,null,null,18.333333333333325]
["18:30:00",1.125E-2,1.125E-2,99999,null,null,18.499999999999993]
["18:40:00",1.0999999999999999E-2,1.0999999999999999E-2,99999,null,null,18.666666666666661]
["18:50:00",1.0749999999999999E-2,1.0749999999999999E-2,99999,null,null,18.833333333333329]
["19:00:00",1.0749999999999999E-2,1.0749999999999999E-2,99999,null,null,18.999999999999996]
["19:10:00",1.0500000000000001E-2,1.0500000000000001E-2,99999,null,null,19.166666666666664]
["19:20:00",1.025E-2,1.025E-2,99999,null,null,19.333333333333332]
["19:30:00",1.025E-2,1.025E-2,99999,null,null,19.5]
["19:40:00",0.01,0.01,99999,null,null,19.666666666666668]
["19:50:00",9.75E-3,9.75E-3,99999,null,null,19.833333333333336]
["20:00:00",9.75E-3,9.75E-3,99999,null,null,20.000000000000004]
["20:10:00",9.4999999999999998E-3,9.4999999999999998E-3,99999,null,null,20.166666666666671]
["20:20:00",9.4999999999999998E-3,9.4999999999999998E-3,99999,null,null,20.333333333333339]
["20:30:00",9.2499999999999995E-3,9.2499999999999995E-3,99999,null,null,20.500000000000007]
["20:40:00",9.2499999999999995E-3,9.2499999999999995E-3,99999,null,null,20.666666666666675]
["20:50:00",8.9999999999999993E-3,8.9999999999999993E-3,99999,null,null,20.833333333333343]
["21:00:00",8.9999999999999993E-3,8.9999999999999993E-3,99999,null,null,21.000000000000011]
["21:10:00",8.7500000000000008E-3,8.7500000000000008E-3,99999,null,null,21.166666666666679]
["21:20:00",8.7500000000000008E-3,8.7500000000000008E-3,99999,null,null,21.333333333333346]
["21:30:00",8.7500000000000008E-3,8.7500000000000008E-3,99999,null,null,21.500000000000014]
["21:40:00",8.5000000000000006E-3,8.5000000000000006E-3,{"$f":"D134","v":99999},null,null,{"$f":"G134+1/6","v":21.666666666666682}]
["21:50:00",8.5000000000000006E-3,8.5000000000000006E-3,99999,null,null,21.83333333333335]
["22:00:00",8.2500000000000004E-3,8.2500000000000004E-3,99999,null,null,22.000000000000018]
["22:10:00",8.2500000000000004E-3,8.2500000000000004E-3,99999,null,null,22.166666666666686]
["22:20:00",8.2500000000000004E-3,8.2500000000000004E-3,99999,null,null,22.333333333333353]
["22:30:00",8.0000000000000002E-3,8.0000000000000002E-3,99999,null,null,22.500000000000021]
["22:40:00",8.0000000000000002E-3,8.0000000000000002E-3,99999,null,null,22.666666666666689]
["22:50:00",8.0000000000000002E-3,8.0000000000000002E-3,99999,null,null,22.833333333333357]
["23:00:00",7.7499999999999999E-3,7.7499999999999999E-3,99999,null,null,23.000000000000025]
["23:10:00",7.7499999999999999E-3,7.7499999999999999E-3,99999,null,null,23.166666666666693]
["23:20:00",7.7499999999999999E-3,7.7499999999999999E-3,99999,null,null,23.333333333333361]
["23:30:00",7.4999999999999997E-3,7.4999999999999997E-3,99999,null,null,23.500000000000028]
["23:40:00",7.4999999999999997E-3,7.4999999999999997E-3,99999,null,null,23.666666666666696]
["23:50:00",7.4999999999999997E-3,7.4999999999999997E-3,99999,null,null,23.833333333333364]
[1,7.2500000000000004E-3,7.2500000000000004E-3,99999,null,null,24.000000000000032]

{"sheet":"逐次計算（浸透考慮）","index":18,"n_rows":148,"n_cols":8,"rows_kept":148,"cut":false,"hidden":true,"merged":[]}
["時刻","行為後流入量","許容放流量","調整池水位","調節後放流量"]
[null,null,null,null,{"$f":"MAX(E3:E147)","v":3.1815153632237782E-2}]
[{"$f":"runoff!A4","v":"00:00:00"},{"$f":"浸透計算!C5","v":0},{"$f":"runoff!$B$1","v":{"$error":"#DIV/0!"}},0,0,null,null,0]
[{"$f":"runoff!A5","v":"00:10:00"},{"$f":"浸透計算!C6","v":7.4999999999999997E-3},{"$f":"runoff!$B$1","v":{"$error":"#DIV/0!"}},0,0,null,null,{"$f":"H3+1/6","v":0.16666666666666666}]
[{"$f":"runoff!A6","v":"00:20:00"},{"$f":"浸透計算!C7","v":7.4999999999999997E-3},{"$f":"runoff!$B$1","v":{"$error":"#DIV/0!"}},3.1529374724926628E-4,3.0153431841110898E-6,null,null,{"$f":"H4+1/6","v":0.33333333333333331}]
[{"$f":"runoff!A7","v":"00:30:00"},{"$f":"浸透計算!C8","v":7.4999999999999997E-3},{"$f":"runoff!$B$1","v":{"$error":"#DIV/0!"}},9.4532963762935488E-4,1.6131263333779928E-5,null,null,0.5]
[{"$f":"runoff!A8","v":"00:40:00"},{"$f":"浸透計算!C9","v":7.4999999999999997E-3},{"$f":"runoff!$B$1","v":{"$error":"#DIV/0!"}},1.5740494297300251E-3,3.4309235605831888E-5,null,null,0.66666666666666663]
[{"$f":"runoff!A9","v":"00:50:00"},{"$f":"浸透計算!C10","v":7.7499999999999999E-3},{"$f":"runoff!$B$1","v":{"$error":"#DIV/0!"}},2.2010693540432738E-3,5.655034183469629E-5,null,null,0.83333333333333326]
[{"$f":"runoff!A10","v":"01:00:00"},{"$f":"浸透計算!C11","v":7.7499999999999999E-3},{"$f":"runoff!$B$1","v":{"$error":"#DIV/0!"}},2.8365548888863801E-3,8.3015829673665711E-5,null,null,0.99999999999999989]
[{"$f":"runoff!A11","v":"01:10:00"},{"$f":"浸透計算!C12","v":7.7499999999999999E-3},{"$f":"runoff!$B$1","v":{"$error":"#DIV/0!"}},3.4801944283836977E-3,1.1266623116789614E-4,null,null,1.1666666666666665]
[{"$f":"runoff!A12","v":"01:20:00"},{"$f":"浸透計算!C13","v":8.0000000000000002E-3},{"$f":"runoff!$B$1","v":{"$error":"#DIV/0!"}},4.1212191601763433E-3,1.4519014620699007E-4,null,null,1.3333333333333333]
[{"$f":"runoff!A13","v":"01:30:00"},{"$f":"浸透計算!C14","v":8.0000000000000002E-3},{"$f":"runoff!$B$1","v":{"$error":"#DIV/0!"}},4.769867469244393E-3,1.8139450484161028E-4,null,null,1.5]
[{"$f":"runoff!A14","v":"01:40:00"},{"$f":"浸透計算!C15","v":8.0000000000000002E-3},{"$f":"runoff!$B$1","v":{"$error":"#DIV/0!"}},5.4259223179810943E-3,2.1907909186348601E-4,null,null,1.6666666666666667]
[{"$f":"runoff!A15","v":"01:50:00"},{"$f":"浸透計算!C16","v":8.2500000000000004E-3},{"$f":"runoff!$B$1","v":{"$error":"#DIV/0!"}},6.0786613243761891E-3,2.6023786718648313E-4,null,null,1.8333333333333335]
[{"$f":"runoff!A16","v":"02:00:00"},{"$f":"浸透計算!C17","v":8.2500000000000004E-3},{"$f":"runoff!$B$1","v":{"$error":"#DIV/0!"}},6.7383558114491654E-3,3.0369321796719655E-4,null,null,2]
[{"$f":"runoff!A17","v":"02:10:00"},{"$f":"浸透計算!C18","v":8.5000000000000006E-3},{"$f":"runoff!$B$1","v":{"$error":"#DIV/0!"}},7.4048174677412565E-3,3.4932962130975527E-4,null,null,2.1666666666666665]
[{"$f":"runoff!A18","v":"02:20:00"},{"$f":"浸透計算!C19","v":8.5000000000000006E-3},{"$f":"runoff!$B$1","v":{"$error":"#DIV/0!"}},8.0778100731500619E-3,3.984017611919801E-4,null,null,2.333333333333333]
[{"$f":"runoff!A19","v":"02:30:00"},{"$f":"浸透計算!C20","v":8.5000000000000006E-3},{"$f":"runoff!$B$1","v":{"$error":"#DIV/0!"}},8.7571006370032855E-3,4.4957816496470917E-4,null,null,2.4999999999999996]
[{"$f":"runoff!A20","v":"02:40:00"},{"$f":"浸透計算!C21","v":8.7500000000000008E-3},{"$f":"runoff!$B$1","v":{"$error":"#DIV/0!"}},9.4320016461078762E-3,5.0277561854834482E-4,null,null,2.6666666666666661]
[{"$f":"runoff!A21","v":"02:50:00"},{"$f":"浸透計算!C22","v":8.7500000000000008E-3},{"$f":"runoff!$B$1","v":{"$error":"#DIV/0!"}},1.0112860238781296E-2,5.5792006677259835E-4,null,null,2.8333333333333326]
[{"$f":"runoff!A22","v":"03:00:00"},{"$f":"浸透計算!C23","v":8.9999999999999993E-3},{"$f":"runoff!$B$1","v":{"$error":"#DIV/0!"}},1.0799449553422647E-2,6.1651178508857415E-4,null,null,2.9999999999999991]
[{"$f":"runoff!A23","v":"03:10:00"},{"$f":"浸透計算!C24","v":8.9999999999999993E-3},{"$f":"runoff!$B$1","v":{"$error":"#DIV/0!"}},1.1491543923695249E-2,6.770220773184779E-4,null,null,3.1666666666666656]
[{"$f":"runoff!A24","v":"03:20:00"},{"$f":"浸透計算!C25","v":9.2499999999999995E-3},{"$f":"runoff!$B$1","v":{"$error":"#DIV/0!"}},1.218898445588581E-2,7.3939193503926525E-4,null,null,3.3333333333333321]
[{"$f":"runoff!A25","v":"03:30:00"},{"$f":"浸透計算!C26","v":9.2499999999999995E-3},{"$f":"runoff!$B$1","v":{"$error":"#DIV/0!"}},1.2891617003743217E-2,8.0356748257351331E-4,null,null,3.4999999999999987]
[{"$f":"runoff!A26","v":"03:40:00"},{"$f":"浸透計算!C27","v":9.4999999999999998E-3},{"$f":"runoff!$B$1","v":{"$error":"#DIV/0!"}},1.3599217817472973E-2,8.7125761318557671E-4,null,null,3.6666666666666652]
[{"$f":"runoff!A27","v":"03:50:00"},{"$f":"浸透計算!C28","v":9.4999999999999998E-3},{"$f":"runoff!$B$1","v":{"$error":"#DIV/0!"}},1.4311563358368806E-2,9.4074841440241607E-4,null,null,3.8333333333333317]
[{"$f":"runoff!A28","v":"04:00:00"},{"$f":"浸透計算!C29","v":9.75E-3},{"$f":"runoff!$B$1","v":{"$error":"#DIV/0!"}},1.5028504081930428E-2,1.0119943809101233E-3,null,null,3.9999999999999982]
[{"$f":"runoff!A29","v":"04:10:00"},{"$f":"浸透計算!C30","v":9.75E-3},{"$f":"runoff!$B$1","v":{"$error":"#DIV/0!"}},1.5749894133030285E-2,1.084953292937752E-3,null,null,4.1666666666666652]
[{"$f":"runoff!A30","v":"04:20:00"},{"$f":"浸透計算!C31","v":0.01},{"$f":"runoff!$B$1","v":{"$error":"#DIV/0!"}},1.6475509693014662E-2,1.1615211696559137E-3,null,null,4.3333333333333321]
[{"$f":"runoff!A31","v":"04:30:00"},{"$f":"浸透計算!C32","v":0.01},{"$f":"runoff!$B$1","v":{"$error":"#DIV/0!"}},1.7205126605134895E-2,1.2398100310407716E-3,null,null,4.4999999999999991]
[{"$f":"runoff!A32","v":"04:40:00"},{"$f":"浸透計算!C33","v":1.025E-2},{"$f":"runoff!$B$1","v":{"$error":"#DIV/0!"}},1.7938601671095431E-2,1.3197828450087431E-3,null,null,4.6666666666666661]
[{"$f":"runoff!A33","v":"04:50:00"},{"$f":"浸透計算!C34","v":1.0500000000000001E-2},{"$f":"runoff!$B$1","v":{"$error":"#DIV/0!"}},1.8675794711025085E-2,1.4014048722194713E-3,null,null,4.833333333333333]
[{"$f":"runoff!A34","v":"05:00:00"},{"$f":"浸透計算!C35","v":1.0500000000000001E-2},{"$f":"runoff!$B$1","v":{"$error":"#DIV/0!"}},1.9426994021993917E-2,1.486744844743859E-3,null,null,5]
[{"$f":"runoff!A35","v":"05:10:00"},{"$f":"浸透計算!C36","v":1.0749999999999999E-2},{"$f":"runoff!$B$1","v":{"$error":"#DIV/0!"}},2.0181459189930119E-2,1.5737500509953751E-3,null,null,5.166666666666667]
[{"$f":"runoff!A36","v":"05:20:00"},{"$f":"浸透計算!C37","v":1.0999999999999999E-2},{"$f":"runoff!$B$1","v":{"$error":"#DIV/0!"}},2.0938959693907924E-2,1.664571298865702E-3,null,null,5.3333333333333339]
[{"$f":"runoff!A37","v":"05:30:00"},{"$f":"浸透計算!C38","v":1.0999999999999999E-2},{"$f":"runoff!$B$1","v":{"$error":"#DIV/0!"}},2.1709778290595543E-2,1.7570754021175165E-3,null,null,5.5000000000000009]
[{"$f":"runoff!A38","v":"05:40:00"},{"$f":"浸透計算!C39","v":1.125E-2},{"$f":"runoff!$B$1","v":{"$error":"#DIV/0!"}},2.2483260677591582E-2,1.8512322848656024E-3,null,null,5.6666666666666679]
[{"$f":"runoff!A39","v":"05:50:00"},{"$f":"浸透計算!C40","v":1.15E-2},{"$f":"runoff!$B$1","v":{"$error":"#DIV/0!"}},2.3259269035440486E-2,1.9470134285048311E-3,null,null,5.8333333333333348]
[{"$f":"runoff!A40","v":"06:00:00"},{"$f":"浸透計算!C41","v":1.175E-2},{"$f":"runoff!$B$1","v":{"$error":"#DIV/0!"}},2.4048083584115823E-2,2.0467295252149446E-3,null,null,6.0000000000000018]
[{"$f":"runoff!A41","v":"06:10:00"},{"$f":"浸透計算!C42","v":1.2E-2},{"$f":"runoff!$B$1","v":{"$error":"#DIV/0!"}},2.484936963775107E-2,2.1504687550135937E-3,null,null,6.1666666666666687]
[{"$f":"runoff!A42","v":"06:20:00"},{"$f":"浸透計算!C43","v":1.225E-2},{"$f":"runoff!$B$1","v":{"$error":"#DIV/0!"}},2.566288668145858E-2,2.2559037612745235E-3,null,null,6.3333333333333357]
[{"$f":"runoff!A43","v":"06:30:00"},{"$f":"浸透計算!C44","v":1.2500000000000001E-2},{"$f":"runoff!$B$1","v":{"$error":"#DIV/0!"}},2.648828681475841E-2,2.3679152913739666E-3,null,null,6.5000000000000027]
[{"$f":"runoff!A44","v":"06:40:00"},{"$f":"浸透計算!C45","v":1.2749999999999999E-2},{"$f":"runoff!$B$1","v":{"$error":"#DIV/0!"}},2.7325322812867245E-2,2.4792287535936931E-3,null,null,6.6666666666666696]
[{"$f":"runoff!A45","v":"06:50:00"},{"$f":"浸透計算!C46","v":1.2999999999999999E-2},{"$f":"runoff!$B$1","v":{"$error":"#DIV/0!"}},2.8173740034236533E-2,2.5972950938477116E-3,null,null,6.8333333333333366]
[{"$f":"runoff!A46","v":"07:00:00"},{"$f":"浸透計算!C47","v":1.325E-2},{"$f":"runoff!$B$1","v":{"$error":"#DIV/0!"}},2.9033178068461958E-2,2.7171783145699328E-3,null,null,7.0000000000000036]
[{"$f":"runoff!A47","v":"07:10:00"},{"$f":"浸透計算!C48","v":1.35E-2},{"$f":"runoff!$B$1","v":{"$error":"#DIV/0!"}},2.990348523478396E-2,2.8388512862180118E-3,null,null,7.1666666666666705]
[{"$f":"runoff!A48","v":"07:20:00"},{"$f":"浸透計算!C49","v":1.375E-2},{"$f":"runoff!$B$1","v":{"$error":"#DIV/0!"}},3.0784400834064737E-2,2.9649333531057425E-3,null,null,7.3333333333333375]
[{"$f":"runoff!A49","v":"07:30:00"},{"$f":"浸透計算!C50","v":1.4250000000000001E-2},{"$f":"runoff!$B$1","v":{"$error":"#DIV/0!"}},3.167555032011337E-2,3.0955122008489099E-3,null,null,7.5000000000000044]
[{"$f":"runoff!A50","v":"07:40:00"},{"$f":"浸透計算!C51","v":1.4500000000000001E-2},{"$f":"runoff!$B$1","v":{"$error":"#DIV/0!"}},3.2587065781040071E-2,3.2306757282273306E-3,null,null,7.6666666666666714]
[{"$f":"runoff!A51","v":"07:50:00"},{"$f":"浸透計算!C52","v":1.4999999999999999E-2},{"$f":"runoff!$B$1","v":{"$error":"#DIV/0!"}},3.351855788456478E-2,3.3705120324074118E-3,null,null,7.8333333333333384]
[{"$f":"runoff!A52","v":"08:00:00"},{"$f":"浸透計算!C53","v":1.55E-2},{"$f":"runoff!$B$1","v":{"$error":"#DIV/0!"}},3.4469629880595772E-2,3.5151093953001587E-3,null,null,8.0000000000000053]
[{"$f":"runoff!A53","v":"08:10:00"},{"$f":"浸透計算!C54","v":1.575E-2},{"$f":"runoff!$B$1","v":{"$error":"#DIV/0!"}},3.5450391604911854E-2,3.6645562709618196E-3,null,null,8.1666666666666714]
[{"$f":"runoff!A54","v":"08:20:00"},{"$f":"浸透計算!C55","v":1.6250000000000001E-2},{"$f":"runoff!$B$1","v":{"$error":"#DIV/0!"}},3.6449796331317459E-2,3.821820234504952E-3,null,null,8.3333333333333375]
[{"$f":"runoff!A55","v":"08:30:00"},{"$f":"浸透計算!C56","v":1.6750000000000001E-2},{"$f":"runoff!$B$1","v":{"$error":"#DIV/0!"}},3.7467423308863337E-2,3.9812716327375505E-3,null,null,8.5000000000000036]
[{"$f":"runoff!A56","v":"08:40:00"},{"$f":"浸透計算!C57","v":1.7500000000000002E-2},{"$f":"runoff!$B$1","v":{"$error":"#DIV/0!"}},3.8513354966099117E-2,4.1487978507671859E-3,null,null,8.6666666666666696]
[{"$f":"runoff!A57","v":"08:50:00"},{"$f":"浸透計算!C58","v":1.7999999999999999E-2},{"$f":"runoff!$B$1","v":{"$error":"#DIV/0!"}},3.9597291072410321E-2,4.327610288055379E-3,null,null,8.8333333333333357]
[{"$f":"runoff!A58","v":"09:00:00"},{"$f":"浸透計算!C59","v":1.8749999999999999E-2},{"$f":"runoff!$B$1","v":{"$error":"#DIV/0!"}},4.0718523967059314E-2,4.5119631058463446E-3,null,null,9.0000000000000018]
[{"$f":"runoff!A59","v":"09:10:00"},{"$f":"浸透計算!C60","v":1.95E-2},{"$f":"runoff!$B$1","v":{"$error":"#DIV/0!"}},4.1876454065389916E-2,4.7050323338482802E-3,null,null,9.1666666666666679]
[{"$f":"runoff!A60","v":"09:20:00"},{"$f":"浸透計算!C61","v":2.0250000000000001E-2},{"$f":"runoff!$B$1","v":{"$error":"#DIV/0!"}},4.3080721386459478E-2,4.9101669207200415E-3,null,null,9.3333333333333339]
[{"$f":"runoff!A61","v":"09:30:00"},{"$f":"浸透計算!C62","v":2.1250000000000002E-2},{"$f":"runoff!$B$1","v":{"$error":"#DIV/0!"}},4.4330429645301053E-2,5.1245478134912892E-3,null,null,9.5]
[{"$f":"runoff!A62","v":"09:40:00"},{"$f":"浸透計算!C63","v":2.2249999999999999E-2},{"$f":"runoff!$B$1","v":{"$error":"#DIV/0!"}},4.5635170171317678E-2,5.3516219012245793E-3,null,null,9.6666666666666661]
[{"$f":"runoff!A63","v":"09:50:00"},{"$f":"浸透計算!C64","v":2.325E-2},{"$f":"runoff!$B$1","v":{"$error":"#DIV/0!"}},4.7004236348899386E-2,5.5950267651658746E-3,null,null,9.8333333333333321]
[{"$f":"runoff!A64","v":"10:00:00"},{"$f":"浸透計算!C65","v":2.4500000000000001E-2},{"$f":"runoff!$B$1","v":{"$error":"#DIV/0!"}},4.8436372118582892E-2,5.8519671556929121E-3,null,null,9.9999999999999982]
[{"$f":"runoff!A65","v":"10:10:00"},{"$f":"浸透計算!C66","v":2.5999999999999999E-2},{"$f":"runoff!$B$1","v":{"$error":"#DIV/0!"}},4.9940795053731127E-2,6.1261986085600481E-3,null,null,10.166666666666664]
[{"$f":"runoff!A66","v":"10:20:00"},{"$f":"浸透計算!C67","v":2.775E-2},{"$f":"runoff!$B$1","v":{"$error":"#DIV/0!"}},5.153676780924852E-2,6.425115871359772E-3,null,null,10.33333333333333]
[{"$f":"runoff!A67","v":"10:30:00"},{"$f":"浸透計算!C68","v":2.9749999999999999E-2},{"$f":"runoff!$B$1","v":{"$error":"#DIV/0!"}},5.324335075514354E-2,6.7461340818030114E-3,null,null,10.499999999999996]
[{"$f":"runoff!A68","v":"10:40:00"},{"$f":"浸透計算!C69","v":3.2250000000000001E-2},{"$f":"runoff!$B$1","v":{"$error":"#DIV/0!"}},5.5079383524235984E-2,7.0970867419988155E-3,null,null,10.666666666666663]
[{"$f":"runoff!A69","v":"10:50:00"},{"$f":"浸透計算!C70","v":3.5249999999999997E-2},{"$f":"runoff!$B$1","v":{"$error":"#DIV/0!"}},5.7073539183592675E-2,7.4863231355198354E-3,null,null,10.833333333333329]
[{"$f":"runoff!A70","v":"11:00:00"},{"$f":"浸透計算!C71","v":3.925E-2},{"$f":"runoff!$B$1","v":{"$error":"#DIV/0!"}},5.9264277976462082E-2,7.9227766784743525E-3,null,null,{"$f":"H68+1/6","v":10.999999999999995}]
[{"$f":"runoff!A71","v":"11:10:00"},{"$f":"浸透計算!C72","v":4.4249999999999998E-2},{"$f":"runoff!$B$1","v":{"$error":"#DIV/0!"}},6.1710308703725278E-2,8.4160482510450777E-3,null,null,11.166666666666661]
[{"$f":"runoff!A72","v":"11:20:00"},{"$f":"浸透計算!C73","v":5.1249999999999997E-2},{"$f":"runoff!$B$1","v":{"$error":"#DIV/0!"}},6.4489884522328317E-2,8.9918156177270538E-3,null,null,11.333333333333327]
[{"$f":"runoff!A73","v":"11:30:00"},{"$f":"浸透計算!C74","v":6.1749999999999999E-2},{"$f":"runoff!$B$1","v":{"$error":"#DIV/0!"}},6.7721221565613166E-2,9.6741702419444898E-3,null,null,11.499999999999993]
[{"$f":"runoff!A74","v":"11:40:00"},{"$f":"浸透計算!C75","v":8.0250000000000002E-2},{"$f":"runoff!$B$1","v":{"$error":"#DIV/0!"}},7.1624019908745853E-2,1.0525958043566952E-2,null,null,11.666666666666659]
[{"$f":"runoff!A75","v":"11:50:00"},{"$f":"浸透計算!C76","v":0.1215},{"$f":"runoff!$B$1","v":{"$error":"#DIV/0!"}},7.6663132255508387E-2,1.1655148377857366E-2,null,null,11.833333333333325]
[{"$f":"runoff!A76","v":"12:00:00"},{"$f":"浸透計算!C77","v":0.43075000000000002},{"$f":"runoff!$B$1","v":{"$error":"#DIV/0!"}},8.4094609104088572E-2,1.339084655590252E-2,null,null,11.999999999999991]
[{"$f":"runoff!A77","v":"12:10:00"},{"$f":"浸透計算!C78","v":0.17449999999999999},{"$f":"runoff!$B$1","v":{"$error":"#DIV/0!"}},0.10596043462623651,1.8938413250802057E-2,null,null,12.166666666666657]
[{"$f":"runoff!A78","v":"12:20:00"},{"$f":"浸透計算!C79","v":9.5750000000000002E-2},{"$f":"runoff!$B$1","v":{"$error":"#DIV/0!"}},0.12954173064824881,2.5600770225794739E-2,null,null,12.333333333333323]
[{"$f":"runoff!A79","v":"12:30:00"},{"$f":"浸透計算!C80","v":6.9500000000000006E-2},{"$f":"runoff!$B$1","v":{"$error":"#DIV/0!"}},0.13863862978925762,2.8345183532440234E-2,null,null,12.499999999999989]
[{"$f":"runoff!A80","v":"12:40:00"},{"$f":"浸透計算!C81","v":5.6000000000000001E-2},{"$f":"runoff!$B$1","v":{"$error":"#DIV/0!"}},0.14314565952440397,2.9737664987412721E-2,null,null,12.666666666666655]
[{"$f":"runoff!A81","v":"12:50:00"},{"$f":"浸透計算!C82","v":4.7500000000000001E-2},{"$f":"runoff!$B$1","v":{"$error":"#DIV/0!"}},0.14588647475894889,3.0591839435630253E-2,null,null,12.833333333333321]
[{"$f":"runoff!A82","v":"13:00:00"},{"$f":"浸透計算!C83","v":4.1500000000000002E-2},{"$f":"runoff!$B$1","v":{"$error":"#DIV/0!"}},0.14764280898050364,3.1146435740734973E-2,null,null,12.999999999999988]
[{"$f":"runoff!A83","v":"13:10:00"},{"$f":"浸透計算!C84","v":3.6999999999999998E-2},{"$f":"runoff!$B$1","v":{"$error":"#DIV/0!"}},0.14875111301080832,3.1500557316465422E-2,null,null,13.166666666666654]
[{"$f":"runoff!A84","v":"13:20:00"},{"$f":"浸透計算!C85","v":3.3750000000000002E-2},{"$f":"runoff!$B$1","v":{"$error":"#DIV/0!"}},0.14939436484439034,3.1704343529473072E-2,null,null,13.33333333333332]
[{"$f":"runoff!A85","v":"13:30:00"},{"$f":"浸透計算!C86","v":3.1E-2},{"$f":"runoff!$B$1","v":{"$error":"#DIV/0!"}},0.14969894221891131,3.1803483343028016E-2,null,null,13.499999999999986]
[{"$f":"runoff!A86","v":"13:40:00"},{"$f":"浸透計算!C87","v":2.8750000000000001E-2},{"$f":"runoff!$B$1","v":{"$error":"#DIV/0!"}},0.14974652290686741,3.1815153632237782E-2,null,null,13.666666666666652]
[{"$f":"runoff!A87","v":"13:50:00"},{"$f":"浸透計算!C88","v":2.7E-2},{"$f":"runoff!$B$1","v":{"$error":"#DIV/0!"}},0.1495855405711794,3.1762648571899248E-2,null,null,13.833333333333318]
[{"$f":"runoff!A88","v":"14:00:00"},{"$f":"浸透計算!C89","v":2.5250000000000002E-2},{"$f":"runoff!$B$1","v":{"$error":"#DIV/0!"}},0.14926270973748021,3.1663551251615095E-2,null,null,13.999999999999984]
[{"$f":"runoff!A89","v":"14:10:00"},{"$f":"浸透計算!C90","v":2.4E-2},{"$f":"runoff!$B$1","v":{"$error":"#DIV/0!"}},0.14880297128374331,3.1518007537240426E-2,null,null,14.16666666666665]
[{"$f":"runoff!A90","v":"14:20:00"},{"$f":"浸透計算!C91","v":2.2749999999999999E-2},{"$f":"runoff!$B$1","v":{"$error":"#DIV/0!"}},0.14823100675041095,3.133203803310685E-2,null,null,14.333333333333316]
[{"$f":"runoff!A91","v":"14:30:00"},{"$f":"浸透計算!C92","v":2.1749999999999999E-2},{"$f":"runoff!$B$1","v":{"$error":"#DIV/0!"}},0.14757050350701034,3.1123261309974417E-2,null,null,14.499999999999982]
[{"$f":"runoff!A92","v":"14:40:00"},{"$f":"浸透計算!C93","v":2.0750000000000001E-2},{"$f":"runoff!$B$1","v":{"$error":"#DIV/0!"}},0.14683388736952666,3.089183351463758E-2,null,null,14.666666666666648]
[{"$f":"runoff!A93","v":"14:50:00"},{"$f":"浸透計算!C94","v":1.975E-2},{"$f":"runoff!$B$1","v":{"$error":"#DIV/0!"}},0.1460335702615296,3.0637928831070273E-2,null,null,14.833333333333314]
[{"$f":"runoff!A94","v":"15:00:00"},{"$f":"浸透計算!C95","v":1.9E-2},{"$f":"runoff!$B$1","v":{"$error":"#DIV/0!"}},0.1451711930384825,3.0367485139160742E-2,null,null,14.99999999999998]
[{"$f":"runoff!A95","v":"15:10:00"},{"$f":"浸透計算!C96","v":1.8249999999999999E-2},{"$f":"runoff!$B$1","v":{"$error":"#DIV/0!"}},0.14425865431381527,3.008065786959303E-2,null,null,15.166666666666647]
[{"$f":"runoff!A96","v":"15:20:00"},{"$f":"浸透計算!C97","v":1.7749999999999998E-2},{"$f":"runoff!$B$1","v":{"$error":"#DIV/0!"}},0.14330759910324695,2.9783321581698233E-2,null,null,15.333333333333313]
[{"$f":"runoff!A97","v":"15:30:00"},{"$f":"浸透計算!C98","v":1.7000000000000001E-2},{"$f":"runoff!$B$1","v":{"$error":"#DIV/0!"}},0.1423291811899384,2.948128213474981E-2,null,null,15.499999999999979]
[{"$f":"runoff!A98","v":"15:40:00"},{"$f":"浸透計算!C99","v":1.6500000000000001E-2},{"$f":"runoff!$B$1","v":{"$error":"#DIV/0!"}},0.14132403200090515,2.9168931915595928E-2,null,null,15.666666666666645]
[{"$f":"runoff!A99","v":"15:50:00"},{"$f":"浸透計算!C100","v":1.6E-2},{"$f":"runoff!$B$1","v":{"$error":"#DIV/0!"}},0.14029277600149753,2.8852044070319108E-2,null,null,15.833333333333311]
[{"$f":"runoff!A100","v":"16:00:00"},{"$f":"浸透計算!C101","v":1.55E-2},{"$f":"runoff!$B$1","v":{"$error":"#DIV/0!"}},0.13924630610352426,2.8530684614822825E-2,null,null,15.999999999999977]
[{"$f":"runoff!A101","v":"16:10:00"},{"$f":"浸透計算!C102","v":1.525E-2},{"$f":"runoff!$B$1","v":{"$error":"#DIV/0!"}},0.13818499557945466,2.8204921179721003E-2,null,null,16.166666666666643]
[{"$f":"runoff!A102","v":"16:20:00"},{"$f":"浸透計算!C103","v":1.4749999999999999E-2},{"$f":"runoff!$B$1","v":{"$error":"#DIV/0!"}},0.13711949111799734,2.7880407126042044E-2,null,null,16.333333333333311]
[{"$f":"runoff!A103","v":"16:30:00"},{"$f":"浸透計算!C104","v":1.4500000000000001E-2},{"$f":"runoff!$B$1","v":{"$error":"#DIV/0!"}},0.13604992136139485,2.7551584864283694E-2,null,null,16.499999999999979]
[{"$f":"runoff!A104","v":"16:40:00"},{"$f":"浸透計算!C105","v":1.4E-2},{"$f":"runoff!$B$1","v":{"$error":"#DIV/0!"}},0.13497617969508682,2.7229605867929375E-2,null,null,16.666666666666647]
[{"$f":"runoff!A105","v":"16:50:00"},{"$f":"浸透計算!C106","v":1.375E-2},{"$f":"runoff!$B$1","v":{"$error":"#DIV/0!"}},0.13389815723852713,2.6903372543601423E-2,null,null,16.833333333333314]
[{"$f":"runoff!A106","v":"17:00:00"},{"$f":"浸透計算!C107","v":1.35E-2},{"$f":"runoff!$B$1","v":{"$error":"#DIV/0!"}},0.13281620880788314,2.6572956807266818E-2,null,null,16.999999999999982]
[{"$f":"runoff!A107","v":"17:10:00"},{"$f":"浸透計算!C108","v":1.2999999999999999E-2},{"$f":"runoff!$B$1","v":{"$error":"#DIV/0!"}},0.13174050659798264,2.625485129481182E-2,null,null,17.16666666666665]
[{"$f":"runoff!A108","v":"17:20:00"},{"$f":"浸透計算!C109","v":1.2749999999999999E-2},{"$f":"runoff!$B$1","v":{"$error":"#DIV/0!"}},0.13066019431517314,2.593257409643614E-2,null,null,17.333333333333318]
[{"$f":"runoff!A109","v":"17:30:00"},{"$f":"浸透計算!C110","v":1.2500000000000001E-2},{"$f":"runoff!$B$1","v":{"$error":"#DIV/0!"}},0.12957539148873981,2.5611626443200707E-2,null,null,17.499999999999986]
[{"$f":"runoff!A110","v":"17:40:00"},{"$f":"浸透計算!C111","v":1.225E-2},{"$f":"runoff!$B$1","v":{"$error":"#DIV/0!"}},0.12849650007387456,2.5292013865817715E-2,null,null,17.666666666666654]
[{"$f":"runoff!A111","v":"17:50:00"},{"$f":"浸透計算!C112","v":1.2E-2},{"$f":"runoff!$B$1","v":{"$error":"#DIV/0!"}},0.12742340753895043,2.4973741964600293E-2,null,null,17.833333333333321]
[{"$f":"runoff!A112","v":"18:00:00"},{"$f":"浸透計算!C113","v":1.175E-2},{"$f":"runoff!$B$1","v":{"$error":"#DIV/0!"}},0.12635577544210472,2.4662176782619942E-2,null,null,17.999999999999989]
[{"$f":"runoff!A113","v":"18:10:00"},{"$f":"浸透計算!C114","v":1.15E-2},{"$f":"runoff!$B$1","v":{"$error":"#DIV/0!"}},0.12529326677662586,2.4351918152099635E-2,null,null,18.166666666666657]
[{"$f":"runoff!A114","v":"18:20:00"},{"$f":"浸透計算!C115","v":1.15E-2},{"$f":"runoff!$B$1","v":{"$error":"#DIV/0!"}},0.12423577141328296,2.4042971598498757E-2,null,null,18.333333333333325]
[{"$f":"runoff!A115","v":"18:30:00"},{"$f":"浸透計算!C116","v":1.125E-2},{"$f":"runoff!$B$1","v":{"$error":"#DIV/0!"}},0.12319347018146565,2.3740635469157157E-2,null,null,18.499999999999993]
[{"$f":"runoff!A116","v":"18:40:00"},{"$f":"浸透計算!C117","v":1.0999999999999999E-2},{"$f":"runoff!$B$1","v":{"$error":"#DIV/0!"}},0.12216580966074195,2.344484802360652E-2,null,null,18.666666666666661]
[{"$f":"runoff!A117","v":"18:50:00"},{"$f":"浸透計算!C118","v":1.0749999999999999E-2},{"$f":"runoff!$B$1","v":{"$error":"#DIV/0!"}},0.12114194832461306,2.3150299302124869E-2,null,null,18.833333333333329]
[{"$f":"runoff!A118","v":"19:00:00"},{"$f":"浸透計算!C119","v":1.0749999999999999E-2},{"$f":"runoff!$B$1","v":{"$error":"#DIV/0!"}},0.12012178176131723,2.2856994536242452E-2,null,null,18.999999999999996]
[{"$f":"runoff!A119","v":"19:10:00"},{"$f":"浸透計算!C120","v":1.0500000000000001E-2},{"$f":"runoff!$B$1","v":{"$error":"#DIV/0!"}},0.11911550026288069,2.2570143315471018E-2,null,null,19.166666666666664]
[{"$f":"runoff!A120","v":"19:20:00"},{"$f":"浸透計算!C121","v":1.025E-2},{"$f":"runoff!$B$1","v":{"$error":"#DIV/0!"}},0.11812256356401545,2.2289684857547044E-2,null,null,19.333333333333332]
[{"$f":"runoff!A121","v":"19:30:00"},{"$f":"浸透計算!C122","v":1.025E-2},{"$f":"runoff!$B$1","v":{"$error":"#DIV/0!"}},0.11713213952756368,2.2010397786972478E-2,null,null,19.5]
[{"$f":"runoff!A122","v":"19:40:00"},{"$f":"浸透計算!C123","v":0.01},{"$f":"runoff!$B$1","v":{"$error":"#DIV/0!"}},0.11615442729049925,2.1737426516559587E-2,null,null,19.666666666666668]
[{"$f":"runoff!A123","v":"19:50:00"},{"$f":"浸透計算!C124","v":9.75E-3},{"$f":"runoff!$B$1","v":{"$error":"#DIV/0!"}},0.1151891133802687,2.1465593126700253E-2,null,null,19.833333333333336]
[{"$f":"runoff!A124","v":"20:00:00"},{"$f":"浸透計算!C125","v":9.75E-3},{"$f":"runoff!$B$1","v":{"$error":"#DIV/0!"}},0.11422558786743847,2.1194902400596165E-2,null,null,20.000000000000004]
[{"$f":"runoff!A125","v":"20:10:00"},{"$f":"浸透計算!C126","v":9.4999999999999998E-3},{"$f":"runoff!$B$1","v":{"$error":"#DIV/0!"}},0.11327405501755446,2.0930434252201494E-2,null,null,20.166666666666671]
[{"$f":"runoff!A126","v":"20:20:00"},{"$f":"浸透計算!C127","v":9.4999999999999998E-3},{"$f":"runoff!$B$1","v":{"$error":"#DIV/0!"}},0.11233399392705401,2.0672129455253756E-2,null,null,20.333333333333339]
[{"$f":"runoff!A127","v":"20:30:00"},{"$f":"浸透計算!C128","v":9.2499999999999995E-3},{"$f":"runoff!$B$1","v":{"$error":"#DIV/0!"}},0.11140510032986646,2.0414896077872436E-2,null,null,20.500000000000007]
[{"$f":"runoff!A128","v":"20:40:00"},{"$f":"浸透計算!C129","v":9.2499999999999995E-3},{"$f":"runoff!$B$1","v":{"$error":"#DIV/0!"}},0.11048707311937615,2.0163750927119493E-2,null,null,20.666666666666675]
[{"$f":"runoff!A129","v":"20:50:00"},{"$f":"浸透計算!C130","v":8.9999999999999993E-3},{"$f":"runoff!$B$1","v":{"$error":"#DIV/0!"}},0.10957961257772433,1.9913644174379429E-2,null,null,20.833333333333343]
[{"$f":"runoff!A130","v":"21:00:00"},{"$f":"浸透計算!C131","v":8.9999999999999993E-3},{"$f":"runoff!$B$1","v":{"$error":"#DIV/0!"}},0.10868221303902167,1.9674522634772727E-2,null,null,21.000000000000011]
[{"$f":"runoff!A131","v":"21:10:00"},{"$f":"浸透計算!C132","v":8.7500000000000008E-3},{"$f":"runoff!$B$1","v":{"$error":"#DIV/0!"}},0.10779458016296778,1.9431414640286172E-2,null,null,21.166666666666679]
[{"$f":"runoff!A132","v":"21:20:00"},{"$f":"浸透計算!C133","v":8.7500000000000008E-3},{"$f":"runoff!$B$1","v":{"$error":"#DIV/0!"}},0.10691663177790682,1.9194246960052286E-2,null,null,21.333333333333346]
[{"$f":"runoff!A133","v":"21:30:00"},{"$f":"浸透計算!C134","v":8.7500000000000008E-3},{"$f":"runoff!$B$1","v":{"$error":"#DIV/0!"}},0.1060478706158917,1.8962962892307315E-2,null,null,21.500000000000014]
[{"$f":"runoff!A134","v":"21:40:00"},{"$f":"浸透計算!C135","v":8.5000000000000006E-3},{"$f":"runoff!$B$1","v":{"$error":"#DIV/0!"}},0.10519852386844657,1.8732615324721317E-2,null,null,{"$f":"H132+1/6","v":21.666666666666682}]
[{"$f":"runoff!A135","v":"21:50:00"},{"$f":"浸透計算!C136","v":8.5000000000000006E-3},{"$f":"runoff!$B$1","v":{"$error":"#DIV/0!"}},0.10435779372200574,1.8508079268427478E-2,null,null,21.83333333333335]
[{"$f":"runoff!A136","v":"22:00:00"},{"$f":"浸透計算!C137","v":8.2500000000000004E-3},{"$f":"runoff!$B$1","v":{"$error":"#DIV/0!"}},0.1035251936806974,1.8289299491570911E-2,null,null,22.000000000000018]
[{"$f":"runoff!A137","v":"22:10:00"},{"$f":"浸透計算!C138","v":8.2500000000000004E-3},{"$f":"runoff!$B$1","v":{"$error":"#DIV/0!"}},0.10270044511517044,1.8071388622069983E-2,null,null,22.166666666666686]
[{"$f":"runoff!A138","v":"22:20:00"},{"$f":"浸透計算!C139","v":8.2500000000000004E-3},{"$f":"runoff!$B$1","v":{"$error":"#DIV/0!"}},0.10188347479346166,1.7854350138561133E-2,null,null,22.333333333333353]
[{"$f":"runoff!A139","v":"22:30:00"},{"$f":"浸透計算!C140","v":8.0000000000000002E-3},{"$f":"runoff!$B$1","v":{"$error":"#DIV/0!"}},0.10108431995002294,1.7647776138759765E-2,null,null,22.500000000000021]
[{"$f":"runoff!A140","v":"22:40:00"},{"$f":"浸透計算!C141","v":8.0000000000000002E-3},{"$f":"runoff!$B$1","v":{"$error":"#DIV/0!"}},0.10029219355604334,1.7437229229199668E-2,null,null,22.666666666666689]
[{"$f":"runoff!A141","v":"22:50:00"},{"$f":"浸透計算!C142","v":8.0000000000000002E-3},{"$f":"runoff!$B$1","v":{"$error":"#DIV/0!"}},9.9507027156796254E-2,1.7232282930675483E-2,null,null,22.833333333333357]
[{"$f":"runoff!A142","v":"23:00:00"},{"$f":"浸透計算!C143","v":7.7499999999999999E-3},{"$f":"runoff!$B$1","v":{"$error":"#DIV/0!"}},9.8738865927478159E-2,1.7032884077554707E-2,null,null,23.000000000000025]
[{"$f":"runoff!A143","v":"23:10:00"},{"$f":"浸透計算!C144","v":7.7499999999999999E-3},{"$f":"runoff!$B$1","v":{"$error":"#DIV/0!"}},9.7976731439385609E-2,1.6838980417090529E-2,null,null,23.166666666666693]
[{"$f":"runoff!A144","v":"23:20:00"},{"$f":"浸透計算!C145","v":7.7499999999999999E-3},{"$f":"runoff!$B$1","v":{"$error":"#DIV/0!"}},9.7220559151319774E-2,1.6641116210252747E-2,null,null,23.333333333333361]
[{"$f":"runoff!A145","v":"23:30:00"},{"$f":"浸透計算!C146","v":7.4999999999999997E-3},{"$f":"runoff!$B$1","v":{"$error":"#DIV/0!"}},9.6480602850519931E-2,1.6453400275432017E-2,null,null,23.500000000000028]
[{"$f":"runoff!A146","v":"23:40:00"},{"$f":"浸透計算!C147","v":7.4999999999999997E-3},{"$f":"runoff!$B$1","v":{"$error":"#DIV/0!"}},9.5745891812193534E-2,1.626639552477354E-2,null,null,23.666666666666696]
[{"$f":"runoff!A147","v":"23:50:00"},{"$f":"浸透計算!C148","v":7.4999999999999997E-3},{"$f":"runoff!$B$1","v":{"$error":"#DIV/0!"}},9.5016366102929253E-2,1.608010467328817E-2,null,null,23.833333333333364]
[{"$f":"runoff!A148","v":1},{"$f":"浸透計算!C149","v":7.2500000000000004E-3},{"$f":"runoff!$B$1","v":{"$error":"#DIV/0!"}},9.4302284833514563E-2,1.5899161066127751E-2,null,null,24.000000000000032]
[null,null,null,9.3592880341704418E-2,1.5718901294691501E-2]

{"sheet":"調節計算（ポンプ）","index":19,"n_rows":151,"n_cols":8,"rows_kept":151,"cut":false,"hidden":true,"merged":[]}
[]
[null,null,null,null,{"$f":"MAX(E7:E151)","v":9.5699999999999993E-2}]
[]
[]
[]
["時刻","行為後流入量","浸透考慮後流入量","許容放流量","調節後放流量","調整池水位"]
["00:00:00",0,0,9.572E-2,0,0,null,0]
["00:10:00",7.4999999999999997E-3,7.4999999999999997E-3,9.572E-2,0,3.1542056074766354E-4,null,{"$f":"H7+1/6","v":0.16666666666666666}]
["00:20:00",7.4999999999999997E-3,7.4999999999999997E-3,9.572E-2,3.7499999999999999E-3,7.885514018691589E-4,null,{"$f":"H8+1/6","v":0.33333333333333331}]
["00:30:00",7.4999999999999997E-3,7.4999999999999997E-3,9.572E-2,9.3749999999999997E-3,8.6740654205607476E-4,null,0.5]
["00:40:00",7.4999999999999997E-3,7.4999999999999997E-3,9.572E-2,1.03125E-2,6.7026869158878506E-4,null,0.66666666666666663]
["00:50:00",7.7499999999999999E-3,7.7499999999999999E-3,9.572E-2,7.9687500000000001E-3,5.4278621495327107E-4,null,0.83333333333333326]
["01:00:00",7.7499999999999999E-3,7.7499999999999999E-3,9.572E-2,6.4531250000000005E-3,5.8812792056074767E-4,null,0.99999999999999989]
["01:10:00",7.7499999999999999E-3,7.7499999999999999E-3,9.572E-2,6.9921875000000001E-3,6.745400116822429E-4,null,1.1666666666666665]
["01:20:00",8.0000000000000002E-3,8.0000000000000002E-3,9.572E-2,8.0195312499999998E-3,7.0558922313084113E-4,null,1.3333333333333333]
["01:30:00",8.0000000000000002E-3,8.0000000000000002E-3,9.572E-2,8.3886718749999999E-3,6.8842180198598136E-4,null,1.5]
["01:40:00",8.0000000000000002E-3,8.0000000000000002E-3,9.572E-2,8.1845703125000002E-3,6.6431348568925231E-4,null,1.6666666666666667]
["01:50:00",8.2500000000000004E-3,8.2500000000000004E-3,9.572E-2,7.8979492187500003E-3,6.7135705680490662E-4,null,1.8333333333333335]
["02:00:00",8.2500000000000004E-3,8.2500000000000004E-3,9.572E-2,7.9816894531250012E-3,6.9744701920268699E-4,null,2]
["02:10:00",8.5000000000000006E-3,8.5000000000000006E-3,9.572E-2,8.2918701171875008E-3,7.1748423353533875E-4,null,2.1666666666666665]
["02:20:00",8.5000000000000006E-3,8.5000000000000006E-3,9.572E-2,8.5300903320312503E-3,7.2497187819436329E-4,null,2.333333333333333]
["02:30:00",8.5000000000000006E-3,8.5000000000000006E-3,9.572E-2,8.6191101074218745E-3,7.1869709335754979E-4,null,2.4999999999999996]
["02:40:00",8.7500000000000008E-3,8.7500000000000008E-3,9.572E-2,8.5445098876953136E-3,7.2232989730121951E-4,null,2.6666666666666661]
["02:50:00",8.7500000000000008E-3,8.7500000000000008E-3,9.572E-2,8.5876998901367203E-3,7.3779771038304991E-4,null,2.8333333333333326]
["03:00:00",8.9999999999999993E-3,8.9999999999999993E-3,9.572E-2,8.7715950012207059E-3,7.542292336437191E-4,null,2.9999999999999991]
["03:10:00",8.9999999999999993E-3,8.9999999999999993E-3,9.572E-2,8.9669475555419938E-3,7.652251074247269E-4,null,3.1666666666666656]
["03:20:00",9.2499999999999995E-3,9.2499999999999995E-3,9.572E-2,9.0976762771606424E-3,7.730213013764849E-4,null,3.3333333333333321]
["03:30:00",9.2499999999999995E-3,9.2499999999999995E-3,9.572E-2,9.1903643608093211E-3,7.8193548015344911E-4,null,3.4999999999999987]
["03:40:00",9.4999999999999998E-3,9.4999999999999998E-3,9.572E-2,9.2963440418243389E-3,7.930084912576409E-4,null,3.6666666666666652]
["03:50:00",9.4999999999999998E-3,9.4999999999999998E-3,9.572E-2,9.4279898405075085E-3,8.0460192611284348E-4,null,3.8333333333333317]
["04:00:00",9.75E-3,9.75E-3,9.572E-2,9.5658228993415837E-3,8.1537615667993783E-4,null,3.9999999999999982]
["04:10:00",9.75E-3,9.75E-3,9.572E-2,9.6939165294170383E-3,8.2548057322747229E-4,null,4.1666666666666652]
["04:20:00",0.01,0.01,9.572E-2,9.8140468150377264E-3,8.3565968490928119E-4,null,4.3333333333333321]
["04:30:00",0.01,0.01,9.572E-2,9.9350651428103433E-3,8.4621105116800726E-4,null,4.4999999999999991]
["04:40:00",1.025E-2,1.025E-2,9.572E-2,1.006050916388631E-2,8.5691119714805452E-4,null,4.6666666666666661]
["04:50:00",1.0500000000000001E-2,1.0500000000000001E-2,9.572E-2,1.0187722010537983E-2,8.7801362439189287E-4,null,4.833333333333333]
["05:00:00",1.0500000000000001E-2,1.0500000000000001E-2,9.572E-2,1.0438606423325838E-2,8.9372878371537709E-4,null,5]
["05:10:00",1.0749999999999999E-2,1.0749999999999999E-2,9.572E-2,1.0625442206393927E-2,9.0154916844678871E-4,null,5.166666666666667]
["05:20:00",1.0999999999999999E-2,1.0999999999999999E-2,9.572E-2,1.0718417891534044E-2,9.1862981853393011E-4,null,5.3333333333333339]
["05:30:00",1.0999999999999999E-2,1.0999999999999999E-2,9.572E-2,1.0921487842570059E-2,9.3377396990338357E-4,null,5.5000000000000009]
["05:40:00",1.125E-2,1.125E-2,9.572E-2,1.1101534975518006E-2,9.4331973923612845E-4,null,5.6666666666666679]
["05:50:00",1.15E-2,1.15E-2,9.572E-2,1.1215023566473973E-2,9.6154858560095174E-4,null,5.8333333333333348]
["06:00:00",1.175E-2,1.175E-2,9.572E-2,1.1431744295477981E-2,9.8691816150016875E-4,null,6.0000000000000018]
["06:10:00",1.2E-2,1.2E-2,9.572E-2,1.1733360364502005E-2,1.0115165636505432E-3,null,6.1666666666666687]
["06:20:00",1.225E-2,1.225E-2,9.572E-2,1.2025808034512014E-2,1.0321590141592993E-3,null,6.3333333333333357]
["06:30:00",1.2500000000000001E-2,1.2500000000000001E-2,9.572E-2,1.2271223835005002E-2,1.0512090757216679E-3,null,6.5000000000000027]
["06:40:00",1.2749999999999999E-2,1.2749999999999999E-2,9.572E-2,1.2497707900246496E-2,1.0714409186316515E-3,null,6.6666666666666696]
["06:50:00",1.2999999999999999E-2,1.2999999999999999E-2,9.572E-2,1.2738242032620745E-2,1.0930598466886365E-3,null,6.8333333333333366]
["07:00:00",1.325E-2,1.325E-2,9.572E-2,1.2995267066187123E-2,1.114781426645315E-3,null,7.0000000000000036]
["07:10:00",1.35E-2,1.35E-2,9.572E-2,1.3253512516783189E-2,1.1358607899783393E-3,null,7.1666666666666705]
["07:20:00",1.375E-2,1.375E-2,9.572E-2,1.3504122725298036E-2,1.1565677190496896E-3,null,7.3333333333333375]
["07:30:00",1.4250000000000001E-2,1.4250000000000001E-2,9.572E-2,1.3750305104257423E-2,1.1879235579936192E-3,null,7.5000000000000044]
["07:40:00",1.4500000000000001E-2,1.4500000000000001E-2,9.572E-2,1.4123091189479697E-2,1.2247900690046751E-3,null,7.6666666666666714]
["07:50:00",1.4999999999999999E-2,1.4999999999999999E-2,9.572E-2,1.4561393042611137E-2,1.2590874611130044E-3,null,7.8333333333333384]
["08:00:00",1.55E-2,1.55E-2,9.572E-2,1.496915092656572E-2,1.2998589764279965E-3,null,8.0000000000000053]
["08:10:00",1.575E-2,1.575E-2,9.572E-2,1.5453878941977294E-2,1.3346380941060942E-3,null,8.1666666666666714]
["08:20:00",1.6250000000000001E-2,1.6250000000000001E-2,9.572E-2,1.5867364007705786E-2,1.3631839513624133E-3,null,8.3333333333333375]
["08:30:00",1.6750000000000001E-2,1.6750000000000001E-2,9.572E-2,1.6206742532864245E-2,1.4021233959178793E-3,null,8.5000000000000036]
["08:40:00",1.7500000000000002E-2,1.7500000000000002E-2,9.572E-2,1.6669689262579231E-2,1.4598902830253969E-3,null,8.6666666666666696]
["08:50:00",1.7999999999999999E-2,1.7999999999999999E-2,9.572E-2,1.7356473364857496E-2,1.5218740977593665E-3,null,8.8333333333333357]
["09:00:00",1.8749999999999999E-2,1.8749999999999999E-2,9.572E-2,1.8093392051139134E-2,1.5765526550305363E-3,null,9.0000000000000018]
["09:10:00",1.95E-2,1.95E-2,9.572E-2,1.8743459343140822E-2,1.6359841384486688E-3,null,9.1666666666666679]
["09:20:00",2.0250000000000001E-2,2.0250000000000001E-2,9.572E-2,1.9450033646000838E-2,1.701444713671683E-3,null,9.3333333333333339]
["09:30:00",2.1250000000000002E-2,2.1250000000000002E-2,9.572E-2,2.0228287151430012E-2,1.7780573904152457E-3,null,9.5]
["09:40:00",2.2249999999999999E-2,2.2249999999999999E-2,9.572E-2,2.113912675271459E-2,1.8677455907082296E-3,null,9.6666666666666661]
["09:50:00",2.325E-2,2.325E-2,9.572E-2,2.2205419800642289E-2,1.9583955020156508E-3,null,9.8333333333333321]
["10:00:00",2.4500000000000001E-2,2.4500000000000001E-2,9.572E-2,2.3283146523963846E-2,2.0535025257471685E-3,null,9.9999999999999982]
["10:10:00",2.5999999999999999E-2,2.5999999999999999E-2,9.572E-2,2.4413863361660779E-2,2.1713852875666936E-3,null,10.166666666666664]
["10:20:00",2.775E-2,2.775E-2,9.572E-2,2.581535841884847E-2,2.3194553996013518E-3,null,10.33333333333333]
["10:30:00",2.9749999999999999E-2,2.9749999999999999E-2,9.572E-2,2.757574752859385E-2,2.4922593550827489E-3,null,10.499999999999996]
["10:40:00",3.2250000000000001E-2,3.2250000000000001E-2,9.572E-2,2.9630194554872685E-2,2.6938786132547172E-3,null,10.666666666666663]
["10:50:00",3.5249999999999997E-2,3.5249999999999997E-2,9.572E-2,3.202722351313942E-2,2.9395946758149559E-3,null,10.833333333333329]
["11:00:00",3.925E-2,3.925E-2,9.572E-2,3.4948514479133365E-2,3.2560356013735768E-3,null,{"$f":"H72+1/6","v":10.999999999999995}]
["11:10:00",4.4249999999999998E-2,4.4249999999999998E-2,9.572E-2,3.8710645482996971E-2,3.6699027057699647E-3,null,11.166666666666661]
["11:20:00",5.1249999999999997E-2,5.1249999999999997E-2,9.572E-2,4.3631065501931798E-2,4.2232886923851097E-3,null,11.333333333333327]
["11:30:00",6.1749999999999999E-2,6.1749999999999999E-2,9.572E-2,5.0210210009467418E-2,5.029029441905703E-3,null,11.499999999999993]
["11:40:00",8.0250000000000002E-2,8.0250000000000002E-2,9.572E-2,5.9789572253767805E-2,6.3748329915827261E-3,null,11.666666666666659]
["11:50:00",0.1215,0.1215,9.572E-2,7.578968112215019E-2,9.1577148589506597E-3,null,11.833333333333325]
["12:00:00",0.43075000000000002,0.43075000000000002,9.572E-2,9.5699999999999993E-2,2.5170999297738736E-2,null,11.999999999999991]
["12:10:00",0.17449999999999999,0.17449999999999999,9.572E-2,9.5699999999999993E-2,4.2575905839794814E-2,null,12.166666666666657]
["12:20:00",9.5750000000000002E-2,9.5750000000000002E-2,9.572E-2,9.5699999999999993E-2,4.5892027335121918E-2,null,12.333333333333323]
["12:30:00",6.9500000000000006E-2,6.9500000000000006E-2,9.572E-2,9.5699999999999993E-2,4.4792260979981728E-2,null,12.499999999999989]
["12:40:00",5.6000000000000001E-2,5.6000000000000001E-2,9.572E-2,9.5699999999999993E-2,4.2020765652878926E-2,null,12.666666666666655]
["12:50:00",4.7500000000000001E-2,4.7500000000000001E-2,9.572E-2,9.5699999999999993E-2,3.8324036680916308E-2,null,12.833333333333321]
["13:00:00",4.1500000000000002E-2,4.1500000000000002E-2,9.572E-2,9.5699999999999993E-2,3.4017494624841549E-2,null,12.999999999999988]
["13:10:00",3.6999999999999998E-2,3.6999999999999998E-2,9.572E-2,9.5699999999999993E-2,2.926936378372005E-2,null,13.166666666666654]
["13:20:00",3.3750000000000002E-2,3.3750000000000002E-2,9.572E-2,9.5699999999999993E-2,2.4195298363159305E-2,null,13.33333333333332]
["13:30:00",3.1E-2,3.1E-2,9.572E-2,9.5699999999999993E-2,1.8868896494000427E-2,null,13.499999999999986]
["13:40:00",2.8750000000000001E-2,2.8750000000000001E-2,9.572E-2,9.5699999999999993E-2,1.333221425100977E-2,null,13.666666666666652]
["13:50:00",2.7E-2,2.7E-2,9.572E-2,9.5699999999999993E-2,7.6273077089536959E-3,null,13.833333333333318]
["14:00:00",2.5250000000000002E-2,2.5250000000000002E-2,9.572E-2,9.0680213873116158E-2,1.9863174058787183E-3,null,13.999999999999984]
["14:10:00",2.4E-2,2.4E-2,9.572E-2,2.3615106936558092E-2,0,null,14.16666666666665]
["14:20:00",2.2749999999999999E-2,2.2749999999999999E-2,9.572E-2,0,9.729627923877437E-4,null,14.333333333333316]
["14:30:00",2.1749999999999999E-2,2.1749999999999999E-2,9.572E-2,1.1567446531720954E-2,2.3579767232966755E-3,null,14.499999999999982]
["14:40:00",2.0750000000000001E-2,2.0750000000000001E-2,9.572E-2,2.8033723265860479E-2,2.479890143024559E-3,null,14.666666666666648]
["14:50:00",1.975E-2,1.975E-2,9.572E-2,2.9483138367069759E-2,1.7642277379013246E-3,null,14.833333333333314]
["15:00:00",1.9E-2,1.9E-2,9.572E-2,2.097470755060464E-2,1.2718416946346446E-3,null,14.99999999999998]
["15:10:00",1.8249999999999999E-2,1.8249999999999999E-2,9.572E-2,1.5120784591767441E-2,1.3203957634133887E-3,null,15.166666666666647]
["15:20:00",1.7749999999999998E-2,1.7749999999999998E-2,9.572E-2,1.5698038520581402E-2,1.5382957259781572E-3,null,15.333333333333313]
["15:30:00",1.7000000000000001E-2,1.7000000000000001E-2,9.572E-2,1.828862696440698E-2,1.5703985794132253E-3,null,15.499999999999979]
["15:40:00",1.6500000000000001E-2,1.6500000000000001E-2,9.572E-2,1.8670294221912791E-2,1.4249299313904313E-3,null,15.666666666666645]
["15:50:00",1.6E-2,1.6E-2,9.572E-2,1.6940833628752906E-2,1.2940881058951452E-3,null,15.833333333333311]
["16:00:00",1.55E-2,1.55E-2,9.572E-2,1.5385269703420058E-2,1.2593454423925441E-3,null,15.999999999999977]
["16:10:00",1.525E-2,1.525E-2,9.572E-2,1.4972218037333578E-2,1.2758529673141201E-3,null,16.166666666666643]
["16:20:00",1.4749999999999999E-2,1.4749999999999999E-2,9.572E-2,1.5168474166956762E-2,1.2699360054514424E-3,null,16.333333333333311]
["16:30:00",1.4500000000000001E-2,1.4500000000000001E-2,9.572E-2,1.5098128064811594E-2,1.2271817059845487E-3,null,16.499999999999979]
["16:40:00",1.4E-2,1.4E-2,9.572E-2,1.4589826948927414E-2,1.1772209811076746E-3,null,16.666666666666647]
["16:50:00",1.375E-2,1.375E-2,9.572E-2,1.3995849442057911E-2,1.142075712327918E-3,null,16.833333333333314]
["17:00:00",1.35E-2,1.35E-2,9.572E-2,1.3578011246565248E-2,1.1284554029932993E-3,null,16.999999999999982]
["17:10:00",1.2999999999999999E-2,1.2999999999999999E-2,9.572E-2,1.341608090225367E-2,1.1076758266411017E-3,null,17.16666666666665]
["17:20:00",1.2749999999999999E-2,1.2749999999999999E-2,9.572E-2,1.3169034827844209E-2,1.072554137057546E-3,null,17.333333333333318]
["17:30:00",1.2500000000000001E-2,1.2500000000000001E-2,9.572E-2,1.275147696279527E-2,1.0443550430586895E-3,null,17.499999999999986]
["17:40:00",1.225E-2,1.225E-2,9.572E-2,1.2416221067475532E-2,1.0267883034678616E-3,null,17.666666666666654]
["17:50:00",1.2E-2,1.2E-2,9.572E-2,1.2207372052340132E-2,1.0110764432886981E-3,null,17.833333333333321]
["18:00:00",1.175E-2,1.175E-2,9.572E-2,1.20205754924323E-2,9.909758456113527E-4,null,17.999999999999989]
["18:10:00",1.15E-2,1.15E-2,9.572E-2,1.1781601720046084E-2,9.6775343947908443E-4,null,18.166666666666657]
["18:20:00",1.15E-2,1.15E-2,9.572E-2,1.1505513113806893E-2,9.5567851656003385E-4,null,18.333333333333325]
["18:30:00",1.125E-2,1.125E-2,9.572E-2,1.1361955696880404E-2,9.5073823947505417E-4,null,18.499999999999993]
["18:40:00",1.0999999999999999E-2,1.0999999999999999E-2,9.572E-2,1.1303221291536755E-2,9.3327752500891182E-4,null,18.666666666666661]
["18:50:00",1.0749999999999999E-2,1.0749999999999999E-2,9.572E-2,1.1095632797328175E-2,9.0598926893515296E-4,null,18.833333333333329]
["19:00:00",1.0749999999999999E-2,1.0749999999999999E-2,9.572E-2,1.0771205752895708E-2,8.9056147943975591E-4,null,18.999999999999996]
["19:10:00",1.0500000000000001E-2,1.0500000000000001E-2,9.572E-2,1.0587786477783766E-2,8.8597769403734792E-4,null,19.166666666666664]
["19:20:00",1.025E-2,1.025E-2,9.572E-2,1.0533290362444027E-2,8.7037165870066519E-4,null,19.333333333333332]
["19:30:00",1.025E-2,1.025E-2,9.572E-2,1.0347751942330129E-2,8.5434651504193886E-4,null,19.5]
["19:40:00",0.01,0.01,9.572E-2,1.0157230789943052E-2,8.4362294218932854E-4,null,19.666666666666668]
["19:50:00",9.75E-3,9.75E-3,9.572E-2,1.0029739423806463E-2,8.2524569020920875E-4,null,19.833333333333336]
["20:00:00",9.75E-3,9.75E-3,9.572E-2,9.811254316931705E-3,8.1090483195386527E-4,null,20.000000000000004]
["20:10:00",9.4999999999999998E-3,9.4999999999999998E-3,9.572E-2,9.64075744656262E-3,8.0240901012466469E-4,null,20.166666666666671]
["20:20:00",9.4999999999999998E-3,9.4999999999999998E-3,9.572E-2,9.5397515648154574E-3,7.948175096461473E-4,null,20.333333333333339]
["20:30:00",9.2499999999999995E-3,9.2499999999999995E-3,9.572E-2,9.4494970591264184E-3,7.8475565162990015E-4,null,20.500000000000007]
["20:40:00",9.2499999999999995E-3,9.2499999999999995E-3,9.572E-2,9.3298727471554793E-3,7.7300645416944632E-4,null,20.666666666666675]
["20:50:00",8.9999999999999993E-3,8.9999999999999993E-3,9.572E-2,9.1901878440145291E-3,7.6164876575575435E-4,null,20.833333333333343]
["21:00:00",8.9999999999999993E-3,8.9999999999999993E-3,9.572E-2,9.0551575484295252E-3,7.5133050158754649E-4,null,21.000000000000011]
["21:10:00",8.7500000000000008E-3,8.7500000000000008E-3,9.572E-2,8.9324848522074982E-3,7.4133619501869997E-4,null,21.166666666666679]
["21:20:00",8.7500000000000008E-3,8.7500000000000008E-3,9.572E-2,8.8136636518889883E-3,7.3098415512679168E-4,null,21.333333333333346]
["21:30:00",8.7500000000000008E-3,8.7500000000000008E-3,9.572E-2,8.6905893998407459E-3,7.3080528846526096E-4,null,21.500000000000014]
["21:40:00",8.5000000000000006E-3,8.5000000000000006E-3,9.572E-2,8.6884628739758787E-3,7.253778563888609E-4,null,{"$f":"H136+1/6","v":21.666666666666682}]
["21:50:00",8.5000000000000006E-3,8.5000000000000006E-3,9.572E-2,8.6239367370675689E-3,7.1223955498983754E-4,null,21.83333333333335]
["22:00:00",8.2500000000000004E-3,8.2500000000000004E-3,9.572E-2,8.4677369315458457E-3,6.9787010163693678E-4,null,22.000000000000018]
["22:10:00",8.2500000000000004E-3,8.2500000000000004E-3,9.572E-2,8.296900097239138E-3,6.8674050696840956E-4,null,22.166666666666686]
["22:20:00",8.2500000000000004E-3,8.2500000000000004E-3,9.572E-2,8.1645815828466466E-3,6.8836043631059622E-4,null,22.333333333333353]
["22:30:00",8.0000000000000002E-3,8.0000000000000002E-3,9.572E-2,8.1838407428037555E-3,6.8422117962436426E-4,null,22.500000000000021]
["22:40:00",8.0000000000000002E-3,8.0000000000000002E-3,9.572E-2,8.1346295799785539E-3,6.7082756791856616E-4,null,22.666666666666689]
["22:50:00",8.0000000000000002E-3,8.0000000000000002E-3,9.572E-2,7.9753944185873976E-3,6.6620039040878303E-4,null,22.833333333333357]
["23:00:00",7.7499999999999999E-3,7.7499999999999999E-3,9.572E-2,7.9203824193044212E-3,6.60069588815202E-4,null,23.000000000000025]
["23:10:00",7.7499999999999999E-3,7.7499999999999999E-3,9.572E-2,7.8474940003585118E-3,6.4880375808171414E-4,null,23.166666666666693]
["23:20:00",7.7499999999999999E-3,7.7499999999999999E-3,9.572E-2,7.7135557905270453E-3,6.4623624351176079E-4,null,23.333333333333361]
["23:30:00",7.4999999999999997E-3,7.4999999999999997E-3,9.572E-2,7.6830308950842667E-3,6.400713829019393E-4,null,23.500000000000028]
["23:40:00",7.4999999999999997E-3,7.4999999999999997E-3,9.572E-2,7.6097375522786118E-3,6.2775869119041639E-4,null,23.666666666666696]
["23:50:00",7.4999999999999997E-3,7.4999999999999997E-3,9.572E-2,7.4633533285971727E-3,6.2468477563956562E-4,null,23.833333333333364]
[1,7.2500000000000004E-3,7.2500000000000004E-3,9.572E-2,7.4268078881592802E-3,6.1879014502831285E-4,null,24.000000000000032]