{"text_format":"1","workbook":"xlsx","n_sheets":20,"sheets":["表紙","判別法","事前相談入力シート","事前相談チェックシート","事前相談書","コントロールシート（貯留＋浸透）","ピーク流量算定表","施設諸元（自然調節）","比浸透量","施設諸元（浸透）","施設諸元（浸透_道路管理者用）","調節計算結果","許可申請書","計画説明書","mkrain","runoff","逐次計算（概算）","浸透計算","逐次計算（浸透考慮）","調節計算（自然調節方式）"],"not_rendered":{"charts":1,"images":5,"macros":1,"external_links":0,"defined_names":12,"comments":0,"pivot_tables":0},"unopened":[],"bounds":{"document_bytes":16777216,"sheet_cells":100000,"rows_first":2000,"rows_last":500,"rows_between":2000,"halvings":0,"cell_chars":16384,"cell_head_chars":4096},"cells_cut":0,"cells_raw":0,"read":"whole","date_system":"1900"}

{"sheet":"表紙","index":0,"n_rows":45,"n_cols":7,"rows_kept":45,"cut":false,"hidden":false,"merged":[[44,6,48,24],[10,1,11,29],[13,4,14,26]]}
[]
[]
[]
[]
[]
[]
[]
[]
[]
[]
[null,"【中川・綾瀬川流域（埼玉県版）】調整池容量計算システム"]
[]
[]
[]
[]
[]
[]
[]
[]
[]
[]
[]
[]
[]
[]
[]
[]
[]
[]
[]
[]
[]
[]
[]
[]
[]
[]
[]
[]
[]
[]
[]
[]
[]
[null,null,null,null,null,null,"令和７年３月\n\n中川・綾瀬川流域水害対策協議会"]

{"sheet":"判別法","index":1,"n_rows":0,"n_cols":0,"rows_kept":0,"cut":false,"hidden":false,"merged":[]}

{"sheet":"事前相談入力シート","index":2,"n_rows":54,"n_cols":24,"rows_kept":54,"cut":false,"hidden":false,"merged":[[1,4,1,11],[5,19,11,19],[5,20,11,20],[5,18,11,18],[3,13,4,14],[3,15,4,17],[5,4,11,4],[5,5,11,5],[3,2,4,12],[5,11,11,11],[5,12,11,12],[5,6,11,6],[5,7,11,7],[5,8,11,8],[2,1,2,20],[5,2,11,2],[53,16,55,20],[28,20,34,20],[46,2,46,20],[26,15,27,17],[26,18,27,20],[28,2,34,2],[28,3,34,3],[28,4,34,4],[28,5,34,5],[28,6,34,6],[28,10,34,10],[28,11,34,11],[28,13,34,13],[26,2,27,12],[50,16,50,20],[51,16,52,20],[26,1,34,1],[26,13,27,14],[28,14,34,14],[28,15,34,15],[28,16,34,16],[3,18,4,20],[28,19,34,19],[28,7,34,7],[28,8,34,8],[28,9,34,9],[28,17,34,17],[28,18,34,18],[5,3,11,3],[23,2,23,20],[5,16,11,16],[3,1,11,1],[46,21,46,22],[28,21,34,21],[28,22,34,22],[25,1,25,22],[26,21,27,22],[28,12,34,12],[5,17,11,17],[5,9,11,9],[5,10,11,10],[5,13,11,13],[5,14,11,14],[5,15,11,15]]}
[]
[null,"事前相談入力シート",null,null,"法第３０条の対策の対象とする面積に対して入力してください（※）",null,null,null,null,null,null,null,null,null,null,null,null,null,null,null,null,null,null,"【提出様式】"]
[null,"現況土地利用(ha) 【行為前】"]
[null,"エリアNo","宅地等",null,null,null,null,null,null,null,null,null,null,"舗装された土地",null,"その他土地からの流出雨水量を増加させるおそれのある行為に係る土地",null,null,"左記以外の土地"]
[]
[null,null,"宅地","池沼","水路","ため池","道路（法面を有しないものに限る。）","道路（法面を有するものに限る。）","鉄道線路（法面を有しないものに限る。）","鉄道線路（法面を有するものに限る。）","飛行場（法面を有しないものに限る。）","飛行場（法面を有するものに限る。）","太陽光\nパネル","コンクリート等の不浸透性の材料により覆われた土地（法面を除く）","コンクリート等の不浸透性の材料により覆われた法面","ゴルフ場（雨水を排除するための排水施設を伴うもの）","運動場その他これに類する施設（雨水を排除するための排水施設を伴うものに限る）","ローラーその他これに類する建設機械を用いて締め固められた土地","山地","人工的に造成された植生に覆われた法面","林地、耕地、原野その他ローラーその他これに類する建設機械を用いていない土地"]
[]
[]
[]
[]
[]
[]
[null,"①"]
[null,"②"]
[null,"③"]
[null,"④"]
[null,"⑤"]
[null,"⑥"]
[null,"⑦"]
[null,"⑧"]
[null,"⑨"]
[null,"⑩"]
[null,"小計",{"$f":"SUM(C13:C22)","v":0},0,0,0,0,0,0,0,0,0,0,0,0,0,0,0,0,0,0]
[null,"合　計",{"$f":"SUM(C23:U23)","v":0}]
[]
[null,"計画土地利用(ha) 【行為後】"]
[null,"エリアNo","宅地等",null,null,null,null,null,null,null,null,null,null,"舗装された土地",null,"その他土地からの流出雨水量を増加させるおそれのある行為に係る土地",null,null,"左記以外の土地",null,null,"埼玉県雨水流出抑制施設の設置等に関する条例に関する除外区域"]
[]
[null,null,"宅地","池沼","水路","ため池","道路（法面を有しないものに限る。）","道路（法面を有するものに限る。）","鉄道線路（法面を有しないものに限る。）","鉄道線路（法面を有するものに限る。）","飛行場（法面を有しないものに限る。）","飛行場（法面を有するものに限る。）","太陽光\nパネル","コンクリート等の不浸透性の材料により覆われた土地（法面を除く）","コンクリート等の不浸透性の材料により覆われた法面","ゴルフ場（雨水を排除するための排水施設を伴うもの）","運動場その他これに類する施設（雨水を排除するための排水施設を伴うものに限る）","ローラーその他これに類する建設機械を用いて締め固められた土地","山地","人工的に造成された植生に覆われた法面","林地、耕地、原野その他ローラーその他これに類する建設機械を用いていない土地","生産緑地法に基づく緑地","森林法に基づく残置森林"]
[]
[]
[]
[]
[]
[]
[null,"①"]
[null,"②"]
[null,"③"]
[null,"④"]
[null,"⑤"]
[null,"⑥"]
[null,"⑦"]
[null,"⑧"]
[null,"⑨"]
[null,"⑩"]
[null,"小計",{"$f":"SUM(C36:C45)","v":0},0,0,0,0,0,0,0,0,0,0,0,0,0,0,0,0,0,0,{"$f":"SUM(V36:V45)","v":0},{"$f":"SUM(W36:W45)","v":0}]
[null,"合　計",{"$f":"SUM(C46:U46)","v":0},null,null,null,null,null,null,null,null,null,null,null,null,null,null,null,null,null,null,{"$f":"SUM(V46:W46)","v":0}]
[]
[]
[]
[null,null,null,null,null,null,null,null,null,null,null,null,null,null,null,null,"入力データの整合チェック"]
[null,null,null,null,null,null,null,null,null,null,null,null,null,null,null,null,{"$f":"IF(C24=C47,IF(C24<>0,\"OK\",\"NG\"),\"NG\")","v":"NG"}]
[]
[null,null,null,null,null,null,null,null,null,null,null,null,null,null,null,null,{"$f":"IF(Q52=\"NG\",\"開発前後の面積が異なるか、面積が未入力です。\",\"\")","v":"開発前後の面積が異なるか、面積が未入力です。"}]

{"sheet":"事前相談チェックシート","index":3,"n_rows":30,"n_cols":28,"rows_kept":30,"cut":false,"hidden":false,"merged":[[29,9,29,14],[28,1,28,9],[17,16,17,18],[27,1,27,9],[19,1,22,2],[19,3,19,9],[20,3,20,9],[21,3,21,9],[23,1,26,2],[23,3,23,9],[22,3,22,9],[24,3,24,9],[25,3,25,9],[26,3,26,9],[5,20,5,22],[23,21,23,23],[2,16,2,18],[23,14,26,14],[23,18,23,19],[7,16,7,18],[13,20,14,22],[26,16,27,16],[26,17,27,17],[24,18,27,19],[24,20,27,20],[24,21,27,23],[2,1,3,9],[12,3,12,9],[9,3,9,9],[10,3,10,9],[11,3,11,9],[8,3,8,9],[13,3,13,9],[4,1,15,2],[16,1,18,2],[14,3,14,9],[4,3,4,9],[5,3,5,9],[6,3,6,9],[7,3,7,9],[16,3,16,9],[17,3,17,9],[15,3,15,9],[18,3,18,9]]}
[]
[null,"事前相談チェックシート",null,null,null,null,null,null,null,null,null,null,null,null,null,null,null,null,null,null,null,null,"【提出様式】"]
[null,"土　地　利　用　区　分",null,null,1.6069045212187549E+44,null,null,null,null,null,"流出係数","①現況土地利用【行為前】","②計画土地利用【行為後】","③面積差","雨水浸透阻害行為の\n該当面積",null,"各対象面積集計",null,null,null,"対象地域※２"]
[null,null,null,null,null,null,null,null,null,null,"―","面積（ha）","面積（ha）","（ha）②－①","面積（ha）",null,"開発区域面積※１",null,"(ha)",null,null,null,null,null,null,null,"埼玉県北部",0.47039999999999998]
[null,"宅地等",null,"宅　　　地",null,null,null,null,null,null,0.9,{"$f":"事前相談入力シート!C23","v":0},{"$f":"事前相談入力シート!C46","v":0},{"$f":"M5-L5","v":0},{"$f":"N5","v":0},null,"法第30条の対策の対象とする面積",{"$f":"O28","v":0},"(ha)",null,false,null,null,null,null,null,"埼玉県南部",0.43090000000000001]
[null,null,null,"池　　　沼",null,null,null,null,null,null,1,{"$f":"事前相談入力シート!D23","v":0},{"$f":"事前相談入力シート!D46","v":0},0,0,null,"開発区域面積から「対策の対象とならない面積」を引いた面積",{"$f":"IF(R4>=1,R4-V17,R4-V8)","v":0},"(ha)",null,"都市計画法に基づく開発指導等としての\n必要対策量(開発区域面積1ha未満)"]
[null,null,null,"水　　　路",null,null,null,null,null,null,1,{"$f":"事前相談入力シート!E23","v":0},{"$f":"事前相談入力シート!E46","v":0},0,0,null,null,null,null,null,"対策基準",null,"m3/ha"]
[null,null,null,"た  め　池",null,null,null,null,null,null,1,{"$f":"事前相談入力シート!F23","v":0},{"$f":"事前相談入力シート!F46","v":0},0,0,null,"特定都市河川浸水被害対策法\n第30条の必要対策量",null,null,null,"対策の対象とならない面積\n（控除面積）※４",null,"ha",null,null,null,null,{"$f":"IF(U4=AA4,AB4,IF(U4=AA5,AB5,IF(U4=AA6,AB6,AB7)))","v":0}]
[null,null,null,"道路（法面を有しないものに限る。）",null,null,null,null,null,null,0.9,{"$f":"事前相談入力シート!G23","v":0},{"$f":"事前相談入力シート!G46","v":0},0,0,null,"調整池深さ※３",null,"m",null,"許容比流量※５",null,"m3/s/ha"]
[null,null,null,"道路（法面を有するものに限る。）",null,null,null,null,null,null,null,{"$f":"事前相談入力シート!H23","v":0},{"$f":"事前相談入力シート!H46","v":0},0,0,null,"行為前の流出係数",{"$f":"L29","v":{"$error":"#DIV/0!"}},null,null,"許容放流量※６ ⑤\n(許容比流量×集水面積)",null,"m3/s"]
[null,null,null,"鉄道線路（法面を有しないものに限る。）",null,null,null,null,null,null,0.9,{"$f":"事前相談入力シート!I23","v":0},{"$f":"事前相談入力シート!I46","v":0},0,0,null,"行為前の流出雨水量（許容放流量） ④",{"$f":"runoff!B1","v":{"$error":"#DIV/0!"}},"m3/s",null,"オリフィス径（円・直径）",{"$f":"AA11","v":0},"m",null,null,null,0]
[null,null,null,"鉄道線路（法面を有するものに限る。）",null,null,null,null,null,null,null,{"$f":"事前相談入力シート!J23","v":0},{"$f":"事前相談入力シート!J46","v":0},0,0,null,"行為後の流出係数",{"$f":"M29","v":{"$error":"#DIV/0!"}},null,null,"必要対策量 ②",{"$f":"IF(U5=TRUE,\"不要\",IF(R26=\"不要\",\"不要\",ROUND(V7*R6,0)))","v":"不要"},"m3"]
[null,null,null,"飛行場（法面を有しないものに限る。）",null,null,null,null,null,null,0.9,{"$f":"事前相談入力シート!K23","v":0},{"$f":"事前相談入力シート!K46","v":0},0,0,null,"行為後の流出雨水量（未対策）",{"$f":"runoff!C1","v":{"$error":"#DIV/0!"}},"m3/s"]
[null,null,null,"飛行場（法面を有するものに限る。）",null,null,null,null,null,null,null,{"$f":"事前相談入力シート!L23","v":0},{"$f":"事前相談入力シート!L46","v":0},0,0,null,"オリフィス径(円・直径)",{"$f":"AA14","v":0.20399999999999999},"m",null,"都市計画法に基づく開発指導等としての\n必要対策量（開発区域面積1ha以上）\n【埼玉県雨水流出抑制施設の設置等に関する条例】",null,null,null,null,null,0.20399999999999999]
[null,null,null,"太陽光パネル",null,null,null,null,null,null,0.9,{"$f":"事前相談入力シート!M23","v":0},{"$f":"事前相談入力シート!M46","v":0},0,0,null,"haあたり必要対策量（概算）",{"$f":"AA15","v":650},"m3/ha",null,null,null,null,null,null,null,650]
[null,null,null,"小　　　計",null,null,null,null,null,null,null,{"$f":"SUM(L5:L15)","v":0},{"$f":"SUM(M5:M15)","v":0},0,{"$f":"SUM(O5:O15)","v":0},null,"必要対策量（概算） ①",{"$f":"IF(R25=\"不要\",\"不要\",R15*R5)","v":"不要"},"m3",null,"対策基準（地域別調整容量）",null,"m3/ha"]
[null,"舗装された土地",null,"コンクリート等の不浸透性の材料により覆われた土地（法面を除く）",null,null,null,null,null,null,0.95,{"$f":"事前相談入力シート!N23","v":0},{"$f":"事前相談入力シート!N46","v":0},0,{"$f":"N17","v":0},null,null,null,null,null,"対策の対象とならない面積\n（控除面積）※４",null,"ha"]
[null,null,null,"コンクリート等の不浸透性の材料により覆われた法面",null,null,null,null,null,null,1,{"$f":"事前相談入力シート!O23","v":0},{"$f":"事前相談入力シート!O46","v":0},0,{"$f":"N18","v":0},null,"下水道等の一時放流先との協議によるもの",null,null,null,"湛水区域対策量※７",null,"m3"]
[null,null,null,"小　　　計",null,null,null,null,null,null,null,{"$f":"SUM(L17:L18)","v":0},{"$f":"SUM(M17:M18)","v":0},0,{"$f":"SUM(O17:O18)","v":0},null,"許容比流量※８",null,"m3/s/ha",null,"許容比流量※５（≦0.05）",0.05,"m3/s/ha"]
[null,"その他土地からの流出雨水量を増加させるおそれのある行為に係る土地",null,"ゴルフ場（雨水を排除するための排水施設を伴うもの）",null,null,null,null,null,null,0.5,{"$f":"事前相談入力シート!P23","v":0},{"$f":"事前相談入力シート!P46","v":0},0,{"$f":"MAX(N20,0)","v":0},null,"許容放流量※６ ⑦\n(許容比流量×集水面積)",null,"m3/s",null,"許容放流量※６ ⑥\n(許容比流量×集水面積)",null,"m3/s"]
[null,null,null,"運動場その他これに類する施設（雨水を排除するための排水施設を伴うものに限る。",null,null,null,null,null,null,0.8,{"$f":"事前相談入力シート!Q23","v":0},{"$f":"事前相談入力シート!Q46","v":0},0,{"$f":"MAX(N21,0)","v":0},null,null,null,null,null,"オリフィス径（円・直径）",{"$f":"AA21","v":0},"m",null,null,null,0]
[null,null,null,"ローラーその他これに類する建設機械を用いて締め固められた土地",null,null,null,null,null,null,0.5,{"$f":"事前相談入力シート!R23","v":0},{"$f":"事前相談入力シート!R46","v":0},0,0,null,null,null,null,null,"必要対策量 ③",{"$f":"IF(U5=TRUE,\"不要\",IF(R27=\"不要\",\"不要\",ROUND(V16*R6+V18,0)))","v":"不要"},"m3"]
[null,null,null,"小　　　計",null,null,null,null,null,null,null,{"$f":"SUM(L20:L22)","v":0},{"$f":"SUM(M20:M22)","v":0},0,{"$f":"SUM(O20:O22)","v":0},null,"都市計画法の開発許可等との調整により双方の機能を兼ね備えた対策工事とする（流出抑制量が大きい方で対策）"]
[null,"上記に揚げる土地以外の土地",null,"山　　　地",null,null,null,null,null,null,0.3,{"$f":"事前相談入力シート!S23","v":0},{"$f":"事前相談入力シート!S46","v":0},0,null,null,"他法令等との調整別の対応","申請","必要対策量(m3)（概算）\n①②③を比べ大きい値",null,"許容放流量(m3/s)\n④⑤⑥⑦を比べ小さい値"]
[null,null,null,"人工的に造成された植生に覆われた法面",null,null,null,null,null,null,0.4,{"$f":"事前相談入力シート!T23","v":0},{"$f":"事前相談入力シート!T46","v":0},0,null,null,"法第30条の許可",{"$f":"IF(O28>=0.1,IF(L29<=M29,\"必要\",\"不要\"),\"不要\")","v":"不要"},{"$f":"MAX(R16,V12,V22)","v":0},null,{"$f":"MIN(Z25,Z26,Z27,Z28)","v":99999},{"$f":"MIN(AA25,AA26,AA27,AA28)","v":99999},null,null,{"$f":"IF(S25=R16,R14,IF(S25=V12,V11,V21))","v":0},{"$f":"IF(R25=\"必要\",R11,99999)","v":99999},{"$f":"IF(R14=0,99999,IF(R25=\"必要\",R14,99999))","v":99999}]
[null,null,null,"林地、耕地、原野その他ローラーその他これに類する建設機械を用いていない土地",null,null,null,null,null,null,0.2,{"$f":"事前相談入力シート!U23","v":0},{"$f":"事前相談入力シート!U46","v":0},0,null,null,{"$f":"U6","v":"都市計画法に基づく開発指導等としての\n必要対策量(開発区域面積1ha未満)"},{"$f":"IF(U5=TRUE,\"不要\",IF(AND(R4>=0.05,R4<1),\"必要\",\"不要\"))","v":"不要"},null,null,null,null,null,null,null,{"$f":"IF(V10=0,99999,IF(R26=\"必要\",V10,99999))","v":99999},{"$f":"IF(V11=0,99999,IF(R26=\"必要\",V11,99999))","v":99999}]
[null,null,null,"小　　　計",null,null,null,null,null,null,null,{"$f":"SUM(L24:L26)","v":0},{"$f":"SUM(M24:M26)","v":0},0,null,null,{"$f":"U14","v":"都市計画法に基づく開発指導等としての\n必要対策量（開発区域面積1ha以上）\n【埼玉県雨水流出抑制施設の設置等に関する条例】"},{"$f":"IF(U5=TRUE,\"不要\",IF(R4>=1,\"必要\",\"不要\"))","v":"不要"},null,null,null,null,null,null,null,{"$f":"IF(V20=0,99999,IF(R27=\"必要\",V20,99999))","v":99999},{"$f":"IF(V21=0,99999,IF(R27=\"必要\",V21,99999))","v":99999}]
[null,"合　　　計",null,null,null,null,null,null,null,null,null,{"$f":"L16+L19+L23+L27","v":0},{"$f":"M16+M19+M23+M27","v":0},{"$f":"IF(ABS(M28-L28)<0.000001,\"OK\",\"NG\")","v":"OK"},{"$f":"O16+O19+O23","v":0},null,null,null,null,null,null,null,null,null,null,{"$f":"IF(R20>0,R20,99999)","v":99999},{"$f":"IF(R20=0,99999,ROUND((4*AB28/PI())^0.5,3))","v":99999},{"$f":"R20/0.6/(2*9.8*R9)^0.5","v":{"$error":"#DIV/0!"}}]
[null,"平均流出係数",null,null,null,null,null,null,null,null,null,{"$f":"ROUND((L5*$K5+L6*$K6+L7*$K7+L8*$K8+L9*$K9+L10*$K10+L11*$K11+L12*$K12+L13*$K13+L14*$K14+L15*$K15+L17*$K17+L18*$K18+L20*$K20+L21*$K21+L22*$K22+L24*$K24+L25*$K25+L26*$K26)/L28,3)","v":{"$error":"#DIV/0!"}},{"$f":"ROUND((M5*$K5+M6*$K6+M7*$K7+M8*$K8+M9*$K9+M10*$K10+M11*$K11+M12*$K12+M13*$K13+M14*$K14+M15*$K15+M17*$K17+M18*$K18+M20*$K20+M21*$K21+M22*$K22+M24*$K24+M25*$K25+M26*$K26)/M28,3)","v":{"$error":"#DIV/0!"}}]
[null,null,null,null,null,null,null,null,null,"※雨水浸透阻害行為の該当面積が0.1ha以上の場合、法第30条の許可（協議）が必要です。"]

{"sheet":"事前相談書","index":4,"n_rows":25,"n_cols":32,"rows_kept":25,"cut":false,"hidden":false,"merged":[[0,12,0,13],[5,6,5,13],[17,1,18,5],[18,6,19,6],[20,6,21,6],[7,6,9,13],[10,6,12,13],[13,6,15,13],[16,6,17,6],[22,6,23,6],[20,25,21,25],[22,25,23,25],[20,7,21,13],[22,7,23,13],[24,7,24,10],[24,12,24,13],[16,25,17,25],[17,20,18,24],[18,25,19,25],[16,7,17,13],[18,7,19,13]]}
[null,null,null,null,null,null,null,null,null,null,null,null,"【提出様式】"]
[null,null,null,null,null,null,null,null,null,null,null,"№","－",null,null,null,null,null,null,null,null,null,null,null,null,null,null,null,null,null,"№","－"]
[null,"雨 水 浸 透 阻 害 行 為 事 前 相 談 書",null,null,null,null,null,null,null,null,null,null,null,null,null,null,null,null,null,null,"雨 水 浸 透 阻 害 行 為 事 前 相 談 書"]
[]
[]
[null,"事前相談日時",null,null,null,null,"　　　　　年　　月　　日（　）　：　　～　　：",null,null,null,null,null,null,null,null,null,null,null,null,null,"事前相談日時",null,null,null,null,"　　　○○年○○月○○日（○）XX：XX～　　："]
[]
[]
[null,"事業区域に含まれる地域の名称",null,null,null,null,null,null,null,null,null,null,null,null,null,null,null,null,null,null,"事業区域に含まれる地域の名称",null,null,null,null,"　○○市○○町101番地、102番地、103番地"]
[]
[null,null,null,null,null,null,{"$f":"事前相談チェックシート!R4","v":0}]
[null,"事業区域の面積",null,null,null,null,null,null,null,null,null,null,null,null,null,null,null,null,null,null,"事業区域の面積",null,null,null,null,"　0.250ha"]
[]
[]
[null,"予定する事業の計画の内容",null,null,null,null,null,null,null,null,null,null,null,null,null,null,null,null,null,null,"予定する事業の計画の内容",null,null,null,null,"　分譲住宅（１５宅地）の宅地造成"]
[]
[null,null,null,null,null,null,"住　所",null,null,null,null,null,null,null,null,null,null,null,null,null,null,null,null,null,null,"住　所"]
[null,"事業主又は建築主等の住所・氏名",null,null,null,null,null,null,null,null,null,null,null,null,null,null,null,null,null,null,"事業主又は建築主等の住所・氏名",null,null,null,null,null,null,"○○○○住宅建設株式会社"]
[null,null,null,null,null,null,"氏　名",null,null,null,null,null,null,null,null,null,null,null,null,null,null,null,null,null,null,"氏　名",null,"代表取締役　　○○　○○"]
[]
[null,null,null,null,null,null,"住　所",null,null,null,null,null,null,null,null,null,null,null,null,null,null,null,null,null,null,"住　所"]
[null,null,null,null,null,null,null,null,null,null,null,null,null,null,null,null,null,null,null,null,null,null,null,null,null,null,null,"○○市○○町１－１－１"]
[null,"代理人等の住所・氏名・連絡先",null,null,null,null,"氏　名",null,null,null,null,null,null,null,null,null,null,null,null,null,"代理人等の住所・氏名・連絡先",null,null,null,null,"氏　名",null,"○○○設計事務所株式会社"]
[]
[null,null,null,null,null,null,"連絡先",null,null,null,null,"担当者名",null,null,null,null,null,null,null,null,null,null,null,null,null,"連絡先","XXX","（XXX","）XXXX",null,"担当者名　○○"]

{"sheet":"コントロールシート（貯留＋浸透）","index":5,"n_rows":25,"n_cols":13,"rows_kept":25,"cut":false,"hidden":false,"merged":[[24,2,26,3],[20,2,20,3],[19,2,19,3],[21,2,21,3],[14,2,14,3],[15,2,15,3],[12,5,12,7],[14,9,14,10],[24,5,26,7],[24,9,26,12],[16,5,19,7],[1,9,1,12],[2,9,2,12],[16,2,16,3],[17,2,17,3],[18,2,18,3],[2,5,2,6],[7,5,7,7],[13,5,13,7],[3,2,3,3],[2,2,2,3],[4,2,4,3],[4,5,4,7],[17,9,17,10],[16,9,16,10],[15,9,15,10],[5,5,6,7],[0,2,0,3],[0,9,0,12],[0,5,0,7],[13,9,13,12],[5,9,6,12],[8,9,8,10],[11,9,11,12],[10,9,10,10],[12,2,12,3],[5,2,6,3],[13,2,13,3],[3,9,3,12],[4,9,4,12],[12,9,12,12],[1,2,1,3],[1,5,1,7]]}
[null,null,"浸透施設の計算",null,null,"浸透施設を見込んだ貯留容量",null,null,null,"オリフィス(1段)による自然調節計算"]
[null,null,"事前に入力しておくシート",null,null,"事前に入力しておくシート",null,null,null,"事前に入力しておくシート"]
[null,null,"施設諸元（浸透）",null,null,"施設諸元（浸透）",null,null,null,"施設諸元(自然調節)"]
[null,null,"施設諸元（浸透_道路管理者用）",null,null,"施設諸元（浸透_道路管理者用）"]
[null,null,"その他、事前相談チェックシートに必要な項目",null,null,"その他、事前相談チェックシートに必要な項目"]
[null,null,"浸透施設に該当する項目にチェックを入れてください",null,null,"事前相談チェックシートで計算した必要対策量",null,null,null,"調整池諸元を記入する際の参考値"]
[]
[null,null,2,"浸透施設なし",null,"必要対策量（貯留量換算）",null,null,null,"浸透を考慮した必要な貯留施設容量",null,{"$f":"G15","v":0},"m3"]
[null,null,null,"浸透施設あり\n※施設諸元(浸透)に入力した場合",null,"法",{"$f":"事前相談チェックシート!R16","v":"不要"},"m3",null,"調整池の最大水深\n※オリフィス底部から設計水位\nまでの水深",null,{"$f":"事前相談チェックシート!R9","v":0},"m"]
[null,null,null,"浸透施設あり\n※施設諸元（浸透_道路管理者用）に入力した場合",null,"総合治水対策で\n必要な対策量(1.0ha以上)",{"$f":"事前相談チェックシート!V22","v":"不要"},"m3",null,"オリフィス径",null,{"$f":"事前相談チェックシート!V25","v":99999},"m"]
[null,null,null,null,null,"総合治水対策で\n必要な対策量(1.0ha未満)",{"$f":"事前相談チェックシート!V12","v":"不要"},"m3",null,"　　(オリフィス断面積)",null,{"$f":"PI()*(L10/2)^2","v":7853824555.1272011},"m2"]
[null,null,null,null,null,null,{"$f":"IF(MAX(G9:G11)=G9,1,IF(MAX(G9:G11)=G10,2,3))","v":3},null,null,"※上記数値は事前相談チェックシート記載の数値です"]
[null,null,"計算結果",null,null,"計算結果",null,null,null,"計算結果"]
[null,null,"上のチェックを入れ、「浸透施設の計算」ボタンを押してください",null,null,"上記、事前相談チェックシートで計算した必要対策量を確認の上「浸透施設を見込んだ貯留容量の算定」ボタンを押してください",null,null,null,"上記シートの入力が完了したら「自然調節計算」ボタンを\n押してください"]
[null,null,"Q1:許容放流量(m3/s)",null,null,"必要貯留施設容量",null,"m3",null,"設定したオリフィス断面積",null,{"$f":"IF('施設諸元（自然調節）'!D7=\"円形\",PI()*('施設諸元（自然調節）'!D8/2)^2,'施設諸元（自然調節）'!D9*'施設諸元（自然調節）'!D10)","v":0},"m2"]
[null,null,{"$f":"事前相談チェックシート!U25","v":99999},null,null,null,null,null,null,"設定した貯留施設容量",null,{"$f":"MAX('施設諸元（自然調節）'!C14:C63)","v":0},"m3"]
[null,null,"Q2:行為後ピーク流入量（浸透考慮前）(m3/s)",null,null,"施設諸元(浸透)又は\n施設諸元(浸透_道路管理者用)に\n入力した浸透施設と\n上記貯留施設が必要となります。",null,null,null,"許容放流量",null,{"$f":"事前相談チェックシート!U25","v":99999},"m3/s"]
[null,null,{"$f":"浸透計算!B2","v":0.38900000000000001},null,null,null,null,null,null,"ピーク時のオリフィス放流量（計算値）",null,{"$f":"'調節計算（自然調節方式）'!E2","v":7.91681348704628E-2},"m3/s"]
[null,null,"Q3:行為後ピーク流入量（浸透考慮後）(m3/s)"]
[null,null,{"$f":"浸透計算!C2","v":0.38500299999999998},null,null,null,null,null,null,"貯留量の判定",null,{"$f":"IF(L16>=L8,\"O.K.\",\"N.G.\")","v":"O.K."}]
[null,null,"Q3≦Q1の場合、浸透施設のみで処理可能",null,null,null,null,null,null,"ピーク放流量の判定",null,{"$f":"IF(L18<=L17,\"O.K.\",\"N.G\")","v":"O.K."}]
[]
[]
[]
[null,null,"※浸透施設を見込まない場合も、「浸透施設なし」にチェックの上、「浸透施設の計算」を実施してください",null,null,"※「①浸透施設の計算」実施後に押してください",null,null,null,"※貯留量の判定が「N.G.」となった場合には貯留施設を大きく、ピーク放流量の判定は「N.G」となった場合には放流口径を小さくしてください\n※浸透施設の見直しを行った場合は「①浸透施設の計算」からやり直してください（見直しを行わなかった場合には不要です）"]

{"sheet":"ピーク流量算定表","index":6,"n_rows":46,"n_cols":13,"rows_kept":46,"cut":false,"hidden":false,"merged":[[3,4,3,5],[4,4,4,5],[5,11,6,12]]}
[]
["使用降雨強度及び行為前後のピーク流入量"]
[]
["ピーク流入量（行為前）",null,null,null,{"$f":"事前相談チェックシート!R11","v":{"$error":"#DIV/0!"}},null,"m3／s"]
["ピーク流入量（行為後）",null,null,null,{"$f":"事前相談チェックシート!R13","v":{"$error":"#DIV/0!"}},null,"m3／s"]
[null,null,null,null,null,null,null,null,null,null,null,{"$f":"事前相談チェックシート!U4","v":0}]
[]
["降雨強度の推移表"]
[]
[null,"時","分","降雨量\n（mm/h）","時","分","降雨量\n（mm/h）","時","分","降雨量\n（mm/h）","時","分","降雨量\n（mm/h）"]
[null,0,"0－10",{"$f":"mkrain!G4","v":2.7},6,"0－10",{"$f":"mkrain!G40","v":4.3},12,"0－10",{"$f":"mkrain!G76","v":61.1},18,"0－10",{"$f":"mkrain!G112","v":4.2}]
[null,null,"10－20",{"$f":"mkrain!G5","v":2.7},null,"10－20",{"$f":"mkrain!G41","v":4.4000000000000004},null,"10－20",{"$f":"mkrain!G77","v":34.700000000000003},null,"10－20",{"$f":"mkrain!G113","v":4.0999999999999996}]
[null,null,"20－30",{"$f":"mkrain!G6","v":2.7},null,"20－30",{"$f":"mkrain!G42","v":4.5},null,"20－30",{"$f":"mkrain!G78","v":25.4},null,"20－30",{"$f":"mkrain!G114","v":4}]
[null,null,"30－40",{"$f":"mkrain!G7","v":2.7},null,"30－40",{"$f":"mkrain!G43","v":4.5999999999999996},null,"30－40",{"$f":"mkrain!G79","v":20.5},null,"30－40",{"$f":"mkrain!G115","v":4}]
[null,null,"40－50",{"$f":"mkrain!G8","v":2.8},null,"40－50",{"$f":"mkrain!G44","v":4.7},null,"40－50",{"$f":"mkrain!G80","v":17.399999999999999},null,"40－50",{"$f":"mkrain!G116","v":3.9}]
[null,null,"50－60",{"$f":"mkrain!G9","v":2.8},null,"50－60",{"$f":"mkrain!G45","v":4.8},null,"50－60",{"$f":"mkrain!G81","v":15.2},null,"50－60",{"$f":"mkrain!G117","v":3.8}]
[null,1,"0－10",{"$f":"mkrain!G10","v":2.8},7,"0－10",{"$f":"mkrain!G46","v":4.9000000000000004},13,"0－10",{"$f":"mkrain!G82","v":13.6},19,"0－10",{"$f":"mkrain!G118","v":3.8}]
[null,null,"10－20",{"$f":"mkrain!G11","v":2.9},null,"10－20",{"$f":"mkrain!G47","v":5},null,"10－20",{"$f":"mkrain!G83","v":12.3},null,"10－20",{"$f":"mkrain!G119","v":3.7}]
[null,null,"20－30",{"$f":"mkrain!G12","v":2.9},null,"20－30",{"$f":"mkrain!G48","v":5.0999999999999996},null,"20－30",{"$f":"mkrain!G84","v":11.3},null,"20－30",{"$f":"mkrain!G120","v":3.7}]
[null,null,"30－40",{"$f":"mkrain!G13","v":2.9},null,"30－40",{"$f":"mkrain!G49","v":5.3},null,"30－40",{"$f":"mkrain!G85","v":10.5},null,"30－40",{"$f":"mkrain!G121","v":3.6}]
[null,null,"40－50",{"$f":"mkrain!G14","v":2.9},null,"40－50",{"$f":"mkrain!G50","v":5.4},null,"40－50",{"$f":"mkrain!G86","v":9.8000000000000007},null,"40－50",{"$f":"mkrain!G122","v":3.5}]
[null,null,"50－60",{"$f":"mkrain!G15","v":3},null,"50－60",{"$f":"mkrain!G51","v":5.6},null,"50－60",{"$f":"mkrain!G87","v":9.1999999999999993},null,"50－60",{"$f":"mkrain!G123","v":3.5}]
[null,2,"0－10",{"$f":"mkrain!G16","v":3},8,"0－10",{"$f":"mkrain!G52","v":5.7},14,"0－10",{"$f":"mkrain!G88","v":8.6999999999999993},20,"0－10",{"$f":"mkrain!G124","v":3.4}]
[null,null,"10－20",{"$f":"mkrain!G17","v":3},null,"10－20",{"$f":"mkrain!G53","v":5.9},null,"10－20",{"$f":"mkrain!G89","v":8.1999999999999993},null,"10－20",{"$f":"mkrain!G125","v":3.4}]
[null,null,"20－30",{"$f":"mkrain!G18","v":3.1},null,"20－30",{"$f":"mkrain!G54","v":6.1},null,"20－30",{"$f":"mkrain!G90","v":7.9},null,"20－30",{"$f":"mkrain!G126","v":3.3}]
[null,null,"30－40",{"$f":"mkrain!G19","v":3.1},null,"30－40",{"$f":"mkrain!G55","v":6.3},null,"30－40",{"$f":"mkrain!G91","v":7.5},null,"30－40",{"$f":"mkrain!G127","v":3.3}]
[null,null,"40－50",{"$f":"mkrain!G20","v":3.2},null,"40－50",{"$f":"mkrain!G56","v":6.5},null,"40－50",{"$f":"mkrain!G92","v":7.2},null,"40－50",{"$f":"mkrain!G128","v":3.3}]
[null,null,"50－60",{"$f":"mkrain!G21","v":3.2},null,"50－60",{"$f":"mkrain!G57","v":6.8},null,"50－60",{"$f":"mkrain!G93","v":6.9},null,"50－60",{"$f":"mkrain!G129","v":3.2}]
[null,3,"0－10",{"$f":"mkrain!G22","v":3.2},9,"0－10",{"$f":"mkrain!G58","v":7},15,"0－10",{"$f":"mkrain!G94","v":6.6},21,"0－10",{"$f":"mkrain!G130","v":3.2}]
[null,null,"10－20",{"$f":"mkrain!G23","v":3.3},null,"10－20",{"$f":"mkrain!G59","v":7.3},null,"10－20",{"$f":"mkrain!G95","v":6.4},null,"10－20",{"$f":"mkrain!G131","v":3.1}]
[null,null,"20－30",{"$f":"mkrain!G24","v":3.3},null,"20－30",{"$f":"mkrain!G60","v":7.7},null,"20－30",{"$f":"mkrain!G96","v":6.2},null,"20－30",{"$f":"mkrain!G132","v":3.1}]
[null,null,"30－40",{"$f":"mkrain!G25","v":3.4},null,"30－40",{"$f":"mkrain!G61","v":8},null,"30－40",{"$f":"mkrain!G97","v":6},null,"30－40",{"$f":"mkrain!G133","v":3.1}]
[null,null,"40－50",{"$f":"mkrain!G26","v":3.4},null,"40－50",{"$f":"mkrain!G62","v":8.5},null,"40－50",{"$f":"mkrain!G98","v":5.8},null,"40－50",{"$f":"mkrain!G134","v":3}]
[null,null,"50－60",{"$f":"mkrain!G27","v":3.5},null,"50－60",{"$f":"mkrain!G63","v":8.9},null,"50－60",{"$f":"mkrain!G99","v":5.6},null,"50－60",{"$f":"mkrain!G135","v":3}]
[null,4,"0－10",{"$f":"mkrain!G28","v":3.5},10,"0－10",{"$f":"mkrain!G64","v":9.5},16,"0－10",{"$f":"mkrain!G100","v":5.5},22,"0－10",{"$f":"mkrain!G136","v":3}]
[null,null,"10－20",{"$f":"mkrain!G29","v":3.6},null,"10－20",{"$f":"mkrain!G65","v":10.1},null,"10－20",{"$f":"mkrain!G101","v":5.3},null,"10－20",{"$f":"mkrain!G137","v":2.9}]
[null,null,"20－30",{"$f":"mkrain!G30","v":3.6},null,"20－30",{"$f":"mkrain!G66","v":10.9},null,"20－30",{"$f":"mkrain!G102","v":5.2},null,"20－30",{"$f":"mkrain!G138","v":2.9}]
[null,null,"30－40",{"$f":"mkrain!G31","v":3.7},null,"30－40",{"$f":"mkrain!G67","v":11.8},null,"30－40",{"$f":"mkrain!G103","v":5.0999999999999996},null,"30－40",{"$f":"mkrain!G139","v":2.9}]
[null,null,"40－50",{"$f":"mkrain!G32","v":3.7},null,"40－50",{"$f":"mkrain!G68","v":12.9},null,"40－50",{"$f":"mkrain!G104","v":4.9000000000000004},null,"40－50",{"$f":"mkrain!G140","v":2.8}]
[null,null,"50－60",{"$f":"mkrain!G33","v":3.8},null,"50－60",{"$f":"mkrain!G69","v":14.3},null,"50－60",{"$f":"mkrain!G105","v":4.8},null,"50－60",{"$f":"mkrain!G141","v":2.8}]
[null,5,"0－10",{"$f":"mkrain!G34","v":3.9},11,"0－10",{"$f":"mkrain!G70","v":16.2},17,"0－10",{"$f":"mkrain!G106","v":4.7},23,"0－10",{"$f":"mkrain!G142","v":2.8}]
[null,null,"10－20",{"$f":"mkrain!G35","v":3.9},null,"10－20",{"$f":"mkrain!G71","v":18.8},null,"10－20",{"$f":"mkrain!G107","v":4.5999999999999996},null,"10－20",{"$f":"mkrain!G143","v":2.7}]
[null,null,"20－30",{"$f":"mkrain!G36","v":4},null,"20－30",{"$f":"mkrain!G72","v":22.6},null,"20－30",{"$f":"mkrain!G108","v":4.5},null,"20－30",{"$f":"mkrain!G144","v":2.7}]
[null,null,"30－40",{"$f":"mkrain!G37","v":4.0999999999999996},null,"30－40",{"$f":"mkrain!G73","v":29.2},null,"30－40",{"$f":"mkrain!G109","v":4.4000000000000004},null,"30－40",{"$f":"mkrain!G145","v":2.7}]
[null,null,"40－50",{"$f":"mkrain!G38","v":4.0999999999999996},null,"40－50",{"$f":"mkrain!G74","v":43.6},null,"40－50",{"$f":"mkrain!G110","v":4.3},null,"40－50",{"$f":"mkrain!G146","v":2.7}]
[null,null,"50－60",{"$f":"mkrain!G39","v":4.2},null,"50－60",{"$f":"mkrain!G75","v":127},null,"50－60",{"$f":"mkrain!G111","v":4.3},null,"50－60",{"$f":"mkrain!G147","v":2.6}]

{"sheet":"施設諸元（自然調節）","index":7,"n_rows":13,"n_cols":10,"rows_kept":13,"cut":false,"hidden":false,"merged":[[5,1,5,2],[6,1,9,1],[10,1,10,2]]}
[null,null,null,null,"【提出様式】"]
["流出抑制施設諸元(自然調節)"]
[null,"　（※流出抑制施設の配置位置（平面図）、構造諸元のわかる図面を添付すること）"]
[null,"調整池諸元"]
[null,"放流口径（2段オリフィスの場合は、上・下段の諸元を記載）"]
[null,null,null,"下段","上段（２段オリフィスの場合）",null,null,null,null,"円形"]
[null,"放流口形状","形状",null,null,null,null,null,null,"矩形"]
[null,null,"直径(m)"]
[null,null,"高さ(m)"]
[null,null,"幅(m)"]
[null,"管底位置（池底から）(m)"]
[]
[null,"Ｈ(m)","Ｖ(m3)"]

{"sheet":"比浸透量","index":8,"n_rows":35,"n_cols":31,"rows_kept":35,"cut":false,"hidden":false,"merged":[[1,0,1,3],[1,10,1,11],[29,1,29,2],[30,1,30,2],[31,1,33,1],[24,10,24,11],[24,1,24,2],[24,5,24,6],[24,7,24,8],[26,1,26,2],[27,1,27,2],[28,1,28,2]]}
[1,null,null,null,null,null,null,null,null,null,null,null,null,null,null,null,null,null,null,null,null,null,null,null,null,null,null,null,null,null,1]
["比浸透量計算書",null,null,null,null,null,null,null,null,null,"【提出様式】"]
[null,null,null,null,null,null,null,null,null,null,null,null,null,null,"大型貯留槽"]
[null,null,"透水性舗装",null,null,null,null,null,null,null,null,null,null,null,"側面及び底面"]
[null,null,"浸透側溝および浸透トレンチ",null,null,null,null,null,null,null,null,null,null,null,"W","H","L","a1","a2","b","X","a","b","K"]
[null,null,"円筒ます（側面および底面）",null,null,null,null,null,null,null,null,null,null,1,5,{"$f":"D$14","v":0.5},{"$f":"D$17","v":30},8.83,-0.46100000000000002,7.03,{"$f":"D$17/D$15","v":60},{"$f":"R6*U6^S6","v":1.3373127251853201},{"$f":"T6","v":7.03},{"$f":"(V6*P6+W6)*Q6","v":230.95969087777982}]
[null,null,"円筒ます（底面）",null,null,null,null,null,null,null,null,null,null,2,10,{"$f":"D$14","v":0.5},{"$f":"D$17","v":30},7.88,-0.44600000000000001,14,{"$f":"D$17/D$15","v":60},{"$f":"R7*U7^S7","v":1.2690267005313376},{"$f":"T7","v":14},{"$f":"(V7*P7+W7)*Q7","v":439.03540050797005}]
[null,null,"正方形ます（側面および底面）",null,null,null,null,null,null,null,null,null,null,3,20,0.5,30,7.06,-0.45200000000000001,27.06,60,1.1093800096150195,27.06,828.44070014422516]
[null,null,"正方形ます（底面）",null,null,null,null,null,null,null,null,null,null,4,30,0.5,30,6.43,-0.44400000000000001,39.75,60,1.0440272102962087,39.75,1208.1604081544431]
[null,null,"矩形の桝",null,null,null,null,null,null,null,null,null,null,5,40,0.5,30,5.97,-0.44,52.25,60,0.98534378344875784,52.25,1582.2801567517313]
[null,null,"大型貯留浸透槽（側面及び底面）",null,null,null,null,null,null,null,null,null,null,6,50,0.5,30,5.62,-0.442,64.680000000000007,60,0.92001193831254136,64.680000000000007,1954.2001790746883]
[null,null,"大型貯留浸透槽（底面）",null,null,null,null,null,null,null,null,null,null,7,{"$f":"D15","v":0.5},{"$f":"D$14","v":0.5},{"$f":"D$17","v":30},{"$f":"R11","v":5.62},{"$f":"S11","v":-0.442},{"$f":"T11","v":64.680000000000007},{"$f":"D$17/D$15","v":60},{"$f":"R12*U12^S12","v":0.92001193831254136},64.680000000000007,{"$f":"(V12*P12+W12)*Q12","v":1954.2001790746883}]
[null,null,null,null,null,null,null,null,null,null,null,null,null,null,"上ランク","下ランク"]
[null,null,"H：設計水頭(m)",0.5,null,null,null,null,null,null,null,null,null,null,{"$f":"IF(D15<=O6,1,IF(D15<=O7,2,IF(D15<=O8,3,IF(D15<=O9,4,IF(D15<=O10,5,IF(D15<=O11,6,7))))))","v":1},{"$f":"IF(D15>=O11,7,IF(O14=1,1,O14-1))","v":1},null,"内挿パラ↓"]
[null,null,"W：施設幅(m)",0.5,null,null,null,null,null,null,null,null,null,"W",{"$f":"VLOOKUP(O14,$N$6:$O$12,2,FALSE)","v":5},{"$f":"VLOOKUP(P14,$N$6:$O$12,2,FALSE)","v":5},{"$f":"D15","v":0.5},{"$f":"IF(O14=P14,0,(Q15-P15)/(O15-P15))","v":0}]
[null,null,"D：施設直径(m)",5,null,null,null,null,null,null,null,null,null,"K",{"$f":"VLOOKUP(O14,$N$6:$X$12,11,FALSE)","v":230.95969087777982},{"$f":"VLOOKUP(P14,$N$6:$X$12,11,FALSE)","v":230.95969087777982},{"$f":"(O16-P16)*R15+P16","v":230.95969087777982}]
[null,null,"L：施設延長(m)",30]
[]
[null,null,"K：比浸透量",{"$f":"IFERROR(INDEX($D$35:$L$35,1,$A$1),\"適用外\")","v":1.2939999999999998}]
[null,null,null,null,null,null,null,null,null,null,null,null,null,null,"大型貯留槽"]
[null,null,null,null,null,null,null,null,null,null,null,null,null,null,"底面"]
[null,null,null,null,null,null,null,null,null,null,null,null,null,null,"W","H","L","a1","a2","b","X","a","b","K"]
[null,null,null,null,null,null,null,null,null,null,null,null,null,1,5,{"$f":"D$14","v":0.5},{"$f":"D$17","v":30},1.94,-0.32800000000000001,7.57,{"$f":"D$17/D$15","v":60},{"$f":"R23*U23^S23","v":0.5064867865799888},{"$f":"T23","v":7.57},{"$f":"(V23*P23+W23)*Q23","v":234.69730179869984}]
[null,null,null,null,null,null,null,null,null,null,null,null,null,2,10,{"$f":"D$14","v":0.5},{"$f":"D$17","v":30},2.29,-0.39700000000000002,13.84,{"$f":"D$17/D$15","v":60},{"$f":"R24*U24^S24","v":0.4507227048771153},{"$f":"T24","v":13.84},{"$f":"(V24*P24+W24)*Q24","v":421.9608405731567}]
[null,"施設",null,"透水性舗装\n（浸透池）","浸透側溝\nおよび\n浸透トレンチ","円筒ます",null,"正方形ます",null,"矩形\nのます","大型貯留槽",null,null,3,20,0.5,30,2.37,-0.48799999999999999,26.36,60,0.32137385017974901,26.36,795.62060775269617]
[null,"浸透面",null,"底面","側面\nおよび\n底面","側面\nおよび\n底面","底面","側面\nおよび\n底面","底面","側面\nおよび\n底面","側面\n及び\n底面","底面",null,4,30,0.5,30,2.17,-0.51800000000000002,38.79,60,0.26024199894712419,38.79,1167.6036299842069]
[null,"模式図",null,null,null,null,null,null,null,null,null,null,null,5,40,0.5,30,1.96,-0.55400000000000005,51.16,60,0.20284311845097919,51.16,1537.8426467767647]
[null,"H：設計水頭（m）",1,{"$f":"$D14","v":0.5},{"$f":"$D14","v":0.5},{"$f":"$D14","v":0.5},{"$f":"$D14","v":0.5},{"$f":"$D14","v":0.5},0.5,0.5,0.5,0.5,null,6,50,0.5,30,1.76,-0.60899999999999999,63.5,60,0.14541813026230432,63.5,1907.1812719539346]
[null,"W：施設幅(m)",null,{"$f":"$D15","v":0.5},{"$f":"$D15","v":0.5},{"$f":"$D15","v":0.5},0.5,0.5,0.5,0.5,0.5,0.5,null,7,{"$f":"D15","v":0.5},0.5,30,{"$f":"R28","v":1.76},{"$f":"S28","v":-0.60899999999999999},{"$f":"T28","v":63.5},60,0.14541813026230432,63.5,1907.1812719539346]
[null,"D：施設直径",null,{"$f":"$D16","v":5},5,5,5,5,5,5,5,5,null,null,"上ランク","下ランク"]
[null,"L：施設延長(m)",null,{"$f":"$D17","v":30},{"$f":"$D17","v":30},30,30,30,30,30,30,30,null,null,{"$f":"IF(D15<=O23,1,IF(D15<=O24,2,IF(D15<=O25,3,IF(D15<=O26,4,IF(D15<=O27,5,IF(D15<=O28,6,7))))))","v":1},{"$f":"IF(D32>=O28,7,IF(O31=1,1,O31-1))","v":1},null,"内挿パラ↓"]
[null,"係数","a",1.4E-2,3.093,{"$f":"IF(F30<0.2,\"適用外\",IF(F30<=1,0.475*F30+0.945,IF(F30<=10,6.244*F30+2.853,\"適用外\")))","v":34.073},{"$f":"IF(G30<0.3,\"適用外\",IF(G30<=1,1.497*G30-0.1,IF(G30<=10,2.556*G30-2.052,\"適用外\")))","v":10.728000000000002},{"$f":"IF(H29<=1,0.12*H29+0.985,IF(H29<=10,-0.453*H29^2+8.289*H29+0.753,IF(H29<=80,0.747*H29+21.355,\"適用外\")))","v":1.0449999999999999},{"$f":"IF(I29<=1,1.676*I29-0.137,IF(I29<=10,-0.204*I29^2+3.166*I29-1.936,IF(I29<=80,1.265*I29-15.67,\"適用外\")))","v":0.70099999999999996},{"$f":"3.297*J31+1.971*J29+4.663","v":104.55850000000001},"別途算定","別途算定",null,"W",{"$f":"VLOOKUP(O31,$N$23:$O$29,2,FALSE)","v":5},{"$f":"VLOOKUP(P31,$N$23:$O$29,2,FALSE)","v":5},{"$f":"D15","v":0.5},{"$f":"IF(O31=P31,0,(Q32-P32)/(O32-P32))","v":0}]
[null,null,"b",1.2869999999999999,{"$f":"1.34*E29+0.677","v":1.347},{"$f":"IF(F30<0.2,\"適用外\",IF(F30<=1,6.07*F30+1.01,IF(F30<=10,0.93*F30^2+1.606*F30-0.773,\"適用外\")))","v":30.507000000000001},{"$f":"IF(G30<0.3,\"適用外\",IF(G30<=1,1.13*G30^2+0.638*G30-0.011,IF(G30<=10,0.924*G30^2+0.993*G30-0.087,\"適用外\")))","v":27.978000000000002},{"$f":"IF(H29<=1,7.837*H29+0.82,IF(H29<=10,1.458*H29^2+1.27*H29+0.362,IF(H29<=80,1.263*H29^2+4.295*H29-7.649,\"適用外\")))","v":4.7385000000000002},{"$f":"IF(I29<=1,1.496*I29^2+I29*0.671-0.015,IF(I29<=10,1.345*I29^2+0.736*I29+0.251,IF(I29<=80,1.259*I29^2+2.336*I29-8.13,\"適用外\")))","v":0.69450000000000001},{"$f":"(1.401*J29+0.684)*J31+1.214*J29-0.834","v":41.308},"別途算定","別途算定",null,"K",{"$f":"VLOOKUP(O31,$N$23:$X$29,11,FALSE)","v":234.69730179869984},{"$f":"VLOOKUP(P31,$N$23:$X$29,11,FALSE)","v":234.69730179869984},{"$f":"(O33-P33)*R32+P33","v":234.69730179869984}]
[null,null,"c","-","-",{"$f":"IF(F30<0.2,\"適用外\",IF(F30<=1,2.57*F30-0.188,IF(F30<=10,\"-\",\"適用外\")))","v":"-"},{"$f":"IF(G29<=1,2.858*G29-0.283,IF(G29<80,\"-\",\"適用外\"))","v":1.1460000000000001},{"$f":"IF(H29<=1,2.858*H29-0.283,IF(H29<=80,\"-\",\"適用外\"))","v":1.1460000000000001},"-","-","-","-"]
[null,"比浸透量","K",{"$f":"IF(D28<=1.5,D32*D28+D33,\"適用外\")","v":1.2939999999999998},{"$f":"IF(AND(E28<=1.5,E29<=1.5),E32*E28+E33,\"適用外\")","v":2.8935},{"$f":"IF(F28<=5,IF(F30<0.2,\"適用外\",IF(F30<=1,F32*F28^2+F33*F28+F34,IF(F30<=10,F32*F28+F33,\"適用外\"))),\"適用外\")","v":47.543500000000002},{"$f":"IF(G28<=5,IF(G30<0.3,\"適用外\",IF(G30<10,G32*G30+G33,\"適用外\")),\"適用外\")","v":81.618000000000009},{"$f":"IF(H28<=5,IF(H29<=1,H32*H28^2+H33*H28+H34,IF(H29<=80,H32*H28+H33,\"適用外\")),\"適用外\")","v":3.7765000000000004},{"$f":"IF(AND(I29<=80,I28<=5),I32*I28+I33,\"適用外\")","v":1.0449999999999999},{"$f":"IF(AND(J28<=5,J29<=5,J31<=200),J32*J28+J33,\"適用外\")","v":93.587250000000012},{"$f":"IF(OR(K28<0.5,K28>5),\"適用外\",Q16)","v":230.95969087777982},{"$f":"IF(OR(L28<0.5,L28>5),\"適用外\",Q33)","v":234.69730179869984}]

{"sheet":"施設諸元（浸透）","index":9,"n_rows":60,"n_cols":21,"rows_kept":60,"cut":false,"hidden":false,"merged":[[5,1,7,1],[5,2,5,3],[5,4,7,4],[6,2,7,2],[6,3,7,3],[19,1,21,1],[19,2,19,3],[19,4,21,4],[19,5,19,7],[19,13,21,13],[20,2,21,2],[20,3,21,3],[5,5,5,7],[5,13,7,13],[33,5,33,7],[33,13,35,13],[19,15,19,16],[5,15,5,16],[20,15,21,15],[20,16,21,16],[20,14,21,14],[33,14,35,14],[33,15,35,15],[6,14,7,14],[6,15,7,15],[6,16,7,16],[47,15,49,15],[48,2,49,2],[48,3,49,3],[34,3,35,3],[47,1,49,1],[47,2,47,3],[47,4,49,4],[47,5,47,7],[47,13,49,13],[34,2,35,2],[33,1,35,1],[33,2,33,3],[33,4,35,4],[47,14,49,14]]}
[null,null,null,null,null,null,null,null,null,null,null,null,null,null,null,null,"【提出様式】",null,null,null,{"$f":"MAX(D9:D18,D23:D32,D37:D46,D51:D60)","v":0}]
["流出抑制施設諸元（浸透施設）"]
[null,"浸透施設諸元",null,null,null,null,null,null,null,null,null,null,null,"空隙貯留量諸元"]
[null,"浸透能力",{"$f":"SUM(J9:J60)/3600","v":0},"m3/s",null,null,null,null,null,null,null,null,null,"空隙貯留量",{"$f":"SUM(K9:K60)","v":0},"m3"]
[]
[null,"【浸透ます】","単位設計浸透能",null,"設置数量\n（個）","影響係数",null,null,null,null,null,null,null,"【浸透ます】\n1個あたり","ます部","砕石部"]
[null,null,"比浸透量（㎡）","飽和透水係数\n（m/hr）",null,"（1）","（2）","（3）",null,null,null,null,null,null,"体積\n（ｍ3）","体積\n（ｍ3）","空隙率\n（％）"]
[null,null,null,null,null,"内容（１）","内容（２）","内容（３）"]
[null,1,null,0,null,0.9,0.9,1,{"$f":"D9","v":0},{"$f":"$C9*$I9*$E9*$F9*$G9*$H9","v":0},{"$f":"($O9+$P9*$Q9/100)*$E9","v":0},null,null,1]
[null,2,null,0,null,0.9,0.9,1,{"$f":"D10","v":0},{"$f":"$C10*$I10*$E10*$F10*$G10*$H10","v":0},{"$f":"($O10+$P10*$Q10/100)*$E10","v":0},null,null,2]
[null,3,null,0,null,0.9,0.9,1,0,0,0,null,null,3]
[null,4,null,0,null,0.9,0.9,1,0,0,0,null,null,4]
[null,5,null,0,null,0.9,0.9,1,0,0,0,null,null,5]
[null,6,null,0,null,0.9,0.9,1,0,0,0,null,null,6]
[null,7,null,0,null,0.9,0.9,1,0,0,0,null,null,7]
[null,8,null,0,null,0.9,0.9,1,0,0,0,null,null,8]
[null,9,null,0,null,0.9,0.9,1,0,0,0,null,null,9]
[null,10,null,0,null,0.9,0.9,1,0,0,0,null,null,10]
[]
[null,"【浸透トレンチ】","単位設計浸透能",null,"設置数量\n（ｍ）","影響係数",null,null,null,null,null,null,null,"【浸透トレンチ】\n1mあたり","浸透管部","砕石部"]
[null,null,"比浸透量（㎡）","飽和透水係数\n（m/hr）",null,"（1）","（2）","（3）",null,null,null,null,null,null,"体積\n（ｍ3）","体積\n（ｍ3）","空隙率\n（％）"]
[null,null,null,null,null,"内容（１）","内容（２）","内容（３）"]
[null,1,null,0,null,0.9,0.9,1,{"$f":"D23","v":0},{"$f":"$C23*$I23*$E23*$F23*$G23*$H23","v":0},{"$f":"($O23+$P23*$Q23/100)*$E23","v":0},null,null,1]
[null,2,null,0,null,0.9,0.9,1,0,{"$f":"$C24*$I24*$E24*$F24*$G24*$H24","v":0},0,null,null,2]
[null,3,null,0,null,0.9,0.9,1,0,0,0,null,null,3]
[null,4,null,0,null,0.9,0.9,1,0,0,0,null,null,4]
[null,5,null,0,null,0.9,0.9,1,0,0,0,null,null,5]
[null,6,null,0,null,0.9,0.9,1,0,0,0,null,null,6]
[null,7,null,0,null,0.9,0.9,1,0,0,0,null,null,7]
[null,8,null,0,null,0.9,0.9,1,0,0,0,null,null,8]
[null,9,null,0,null,0.9,0.9,1,0,0,0,null,null,9]
[null,10,null,0,null,0.9,0.9,1,0,0,0,null,null,10]
[]
[null,"【透水性舗装】","単位設計浸透能",null,"設置数量\n（㎡）","影響係数",null,null,null,null,null,null,null,"【透水性舗装】\n1㎡あたり","体積\n（ｍ3）","空隙率\n（％）"]
[null,null,"比浸透量（㎡）","飽和透水係数\n（m/hr）",null,"（1）","（2）","（3）"]
[null,null,null,null,null,"内容（１）","内容（２）","内容（３）"]
[null,1,null,0,null,0.9,0.9,1,{"$f":"D37","v":0},{"$f":"$C37*$I37*$E37*$F37*$G37*$H37","v":0},{"$f":"$E37*($P37/100*O37)","v":0},null,null,1]
[null,2,null,0,null,0.9,0.9,1,0,{"$f":"$C38*$I38*$E38*$F38*$G38*$H38","v":0},{"$f":"$E38*($P38/100*O38)","v":0},null,null,2]
[null,3,null,0,null,0.9,0.9,1,0,0,0,null,null,3]
[null,4,null,0,null,0.9,0.9,1,0,0,0,null,null,4]
[null,5,null,0,null,0.9,0.9,1,0,0,0,null,null,5]
[null,6,null,0,null,0.9,0.9,1,0,0,0,null,null,6]
[null,7,null,0,null,0.9,0.9,1,0,0,0,null,null,7]
[null,8,null,0,null,0.9,0.9,1,0,0,0,null,null,8]
[null,9,null,0,null,0.9,0.9,1,0,0,0,null,null,9]
[null,10,null,0,null,0.9,0.9,1,0,0,0,null,null,10]
[]
[null,"【その他】","単位設計浸透能",null,"設置数量\n（単位）","影響係数",null,null,null,null,null,null,null,"【その他】","体積\n（ｍ3）","空隙率\n（％）"]
[null,null,"比浸透量（㎡）","飽和透水係数\n（m/hr）",null,"（1）","（2）","（3）"]
[null,null,null,null,null,"内容（１）","内容（２）","内容（３）"]
[null,1,null,0,null,0.9,0.9,1,{"$f":"D51","v":0},{"$f":"$C51*$I51*$E51*$F51*$G51*$H51","v":0},{"$f":"$E51*($P51/100*O51)","v":0},null,null,1]
[null,2,null,0,null,0.9,0.9,1,0,{"$f":"$C52*$I52*$E52*$F52*$G52*$H52","v":0},{"$f":"$E52*($P52/100*O52)","v":0},null,null,2]
[null,3,null,0,null,0.9,0.9,1,0,0,0,null,null,3]
[null,4,null,0,null,0.9,0.9,1,0,0,0,null,null,4]
[null,5,null,0,null,0.9,0.9,1,0,0,0,null,null,5]
[null,6,null,0,null,0.9,0.9,1,0,0,0,null,null,6]
[null,7,null,0,null,0.9,0.9,1,0,0,0,null,null,7]
[null,8,null,0,null,0.9,0.9,1,0,0,0,null,null,8]
[null,9,null,0,null,0.9,0.9,1,0,0,0,null,null,9]
[null,10,null,0,null,0.9,0.9,1,0,0,0,null,null,10]

{"sheet":"施設諸元（浸透_道路管理者用）","index":10,"n_rows":62,"n_cols":19,"rows_kept":62,"cut":false,"hidden":false,"merged":[[10,1,11,1],[10,6,10,7],[11,6,11,7],[4,7,4,8],[6,1,6,6],[8,1,8,2],[9,1,9,2],[9,6,9,7],[19,1,19,2],[19,9,19,10],[12,1,13,1],[12,6,12,7],[13,6,13,7],[14,1,14,6],[15,1,15,3],[16,1,16,2],[16,9,16,10],[17,1,17,2],[17,9,17,10],[18,1,18,2],[18,9,18,10],[20,1,20,2],[20,9,20,10],[21,1,21,2],[21,9,21,10],[22,1,22,2],[22,9,22,10],[25,1,25,6],[27,1,29,2],[27,3,27,4],[27,5,29,5],[27,6,29,6],[28,3,29,3],[28,4,29,4],[27,17,29,17],[27,18,29,18],[28,11,29,11],[28,12,29,12],[28,13,29,13],[35,1,35,2],[27,10,29,10],[27,12,27,13],[27,15,29,15],[27,16,29,16],[27,7,27,8],[28,7,29,7],[28,8,29,8],[30,1,30,2],[31,1,31,2],[32,1,32,2],[33,1,33,2],[34,1,34,2],[42,11,43,11],[36,1,36,2],[37,1,37,2],[38,1,38,2],[39,1,39,2],[41,1,43,2],[41,3,41,4],[53,1,53,2],[42,12,43,12],[42,13,43,13],[44,1,44,2],[45,1,45,2],[46,1,46,2],[47,1,47,2],[41,5,43,5],[41,6,43,6],[41,7,41,8],[41,10,43,10],[41,12,41,13],[42,3,43,3],[42,4,43,4],[42,7,43,7],[42,8,43,8],[48,1,48,2],[49,1,49,2],[50,1,50,2],[51,1,51,2],[52,1,52,2],[56,1,56,2],[56,6,56,7],[57,1,57,2],[58,1,58,2],[59,1,59,6]]}
[null,null,null,null,null,null,null,null,null,null,null,null,null,"【提出様式】"]
["流出抑制施設諸元（浸透施設_道路管理者用）"]
[]
[]
[]
["透水性舗装"]
[]
[null,"基本諸元"]
[null,"設置数量(舗装面積) (m2)"]
[null,"飽和透水係数 （m/hr）",null,null,null,null,"上層路盤での貯留率(%)",null,{"$f":"L21","v":0}]
[null,"比浸透量算定定数\nK=aH+b","a",null,null,null,"下層路盤での貯留率(%)",null,{"$f":"L22","v":0}]
[null,null,"b",null,null,null,"下層路盤厚(mm)",null,{"$f":"D22","v":0}]
[null,"目詰まり\n係数","C1",null,null,null,"下層路盤での貯留量(mm)",null,{"$f":"M22","v":0}]
[null,null,"C2",null,null,null,"貯留量の合計(mm)",null,{"$f":"M23","v":0}]
[]
[null,"貯留率と水拘束率"]
[null,null,null,"厚さ(mm)","空気間隙率\n(%)","空気間隙率との関係","水拘束率\n(%)","水拘束量\n(mm)","貯留率\n(%)","貯留量\n(mm)",null,"STEP2での\n貯留率\n(%)","STEP2での\n貯留量\n(mm)"]
[null,"関係式",null,"a","b","b'","c","a×c/100","d (=b+b')","a×d/100",null,"d-c","a×(d-c)/100"]
[null,"表層",null,null,null,null,null,{"$f":"D19*G19/100","v":0},{"$f":"E19+F19","v":0},{"$f":"D19*I19/100","v":0},null,{"$f":"I19-G19","v":0},{"$f":"D19*(I19-G19)/100","v":0}]
[null,"中間層・基層",null,null,null,null,null,{"$f":"D20*G20/100","v":0},{"$f":"E20+F20","v":0},{"$f":"D20*I20/100","v":0},null,{"$f":"I20-G20","v":0},{"$f":"D20*(I20-G20)/100","v":0}]
[null,"上層路盤",null,null,null,null,null,{"$f":"D21*G21/100","v":0},{"$f":"E21+F21","v":0},{"$f":"D21*I21/100","v":0},null,{"$f":"I21-G21","v":0},{"$f":"D21*(I21-G21)/100","v":0}]
[null,"下層路盤",null,null,null,null,null,{"$f":"D22*G22/100","v":0},{"$f":"E22+F22","v":0},{"$f":"D22*I22/100","v":0},null,{"$f":"I22-G22","v":0},{"$f":"D22*(I22-G22)/100","v":0}]
[null,"合計",null,{"$f":"SUM(D19:D22)","v":0},"-","-","-",{"$f":"SUM(H19:H22)","v":0},"-",{"$f":"SUM(J19:J22)","v":0},null,"-",{"$f":"SUM(M19:M22)","v":0}]
[]
["浸透マス・トレンチ"]
[]
[null,"浸透能諸元",null,null,null,null,null,null,null,null,"空隙貯留諸元"]
[null,"【浸透ます】",null,"単位設計浸透能",null,"設置数量\n（個）","設計水頭\n(m)","影響係数",null,null,"【浸透ます】\n1個あたり","ます部","砕石部",null,null,"Σ","設計浸透量","平均設計水頭","設計空隙貯留量"]
[null,null,null,"比浸透量（㎡）","飽和透水係数\n（cm/s）",null,null,"地下水位\n係数","目詰まり\n係数",null,null,"体積\n（ｍ3）","体積\n（ｍ3）","空隙率\n（％）"]
[null,null,null,null,null,null,null,null,null,null,null,null,null,null,"小計"]
[null,1,null,null,null,null,null,1,1,null,1,null,null,null,null,{"$f":"D31*E31*F31*G31*H31*I31","v":0},{"$f":"D31*E31*F31*H31*I31","v":0},null,{"$f":"L31*M31/100","v":0}]
[null,2,null,null,null,null,null,1,1,null,2,null,null,null,null,{"$f":"D32*E32*F32*G32*H32*I32","v":0},{"$f":"D32*E32*F32*H32*I32","v":0},null,{"$f":"L32*M32/100","v":0}]
[null,3,null,null,null,null,null,1,1,null,3,null,null,null,null,0,0,null,0]
[null,4,null,null,null,null,null,1,1,null,4,null,null,null,null,0,0,null,0]
[null,5,null,null,null,null,null,1,1,null,5,null,null,null,null,0,0,null,0]
[null,6,null,null,null,null,null,1,1,null,6,null,null,null,null,0,0,null,0]
[null,7,null,null,null,null,null,1,1,null,7,null,null,null,null,0,0,null,0]
[null,8,null,null,null,null,null,1,1,null,8,null,null,null,null,0,0,null,0]
[null,9,null,null,null,null,null,1,1,null,9,null,null,null,null,0,0,null,0]
[null,10,null,null,null,null,null,1,1,null,10,null,null,null,null,0,0,null,0]
[]
[null,"【浸透トレンチ】",null,"単位設計浸透能",null,"設置数量\n（ｍ）","設計水頭\n(m)","影響係数",null,null,"【浸透トレンチ】\n1mあたり","浸透管部","砕石部"]
[null,null,null,"比浸透量（㎡）","飽和透水係数\n（cm/s）",null,null,"地下水位\n係数","目詰まり\n係数",null,null,"体積\n（ｍ3）","体積\n（ｍ3）","空隙率\n（％）"]
[]
[null,1,null,null,null,null,null,1,1,null,1,null,null,null,null,{"$f":"D45*E45*F45*G45*H45*I45","v":0},{"$f":"D45*E45*F45*H45*I45","v":0},null,{"$f":"L45*M45/100","v":0}]
[null,2,null,null,null,null,null,1,1,null,2,null,null,null,null,{"$f":"D46*E46*F46*G46*H46*I46","v":0},{"$f":"D46*E46*F46*H46*I46","v":0},null,0]
[null,3,null,null,null,null,null,1,1,null,3,null,null,null,null,0,0,null,0]
[null,4,null,null,null,null,null,1,1,null,4,null,null,null,null,0,0,null,0]
[null,5,null,null,null,null,null,1,1,null,5,null,null,null,null,0,0,null,0]
[null,6,null,null,null,null,null,1,1,null,6,null,null,null,null,0,0,null,0]
[null,7,null,null,null,null,null,1,1,null,7,null,null,null,null,0,0,null,0]
[null,8,null,null,null,null,null,1,1,null,8,null,null,null,null,0,0,null,0]
[null,9,null,null,null,null,null,1,1,null,9,null,null,null,null,0,0,null,0]
[null,10,null,null,null,null,null,1,1,null,10,null,null,null,null,0,0,null,0]
[]
[null,"統合諸元"]
[null,"設計浸透能(m3/hr)",null,{"$f":"Q59","v":0}]
[null,"平均設計水頭(m)",null,{"$f":"IF(D57>0,+R59,0)","v":0}]
[null,"設計空隙貯留量(m3)",null,{"$f":"S59","v":0},null,null,null,null,null,null,null,null,null,null,"総合計",{"$f":"P61+P62","v":0},{"$f":"Q61+Q62","v":0},{"$f":"P59/Q59","v":{"$error":"#DIV/0!"}},{"$f":"S61+S62","v":0}]
[]
[null,null,null,null,null,null,null,null,null,null,null,null,null,null,"マス",{"$f":"SUM(P31:P40)","v":0},{"$f":"SUM(Q31:Q40)","v":0},{"$f":"P61/Q61","v":{"$error":"#DIV/0!"}},{"$f":"SUM(S31:S40)","v":0}]
[null,null,null,null,null,null,null,null,null,null,null,null,null,null,"トレンチ",{"$f":"SUM(P45:P54)","v":0},{"$f":"SUM(Q45:Q54)","v":0},{"$f":"P62/Q62","v":{"$error":"#DIV/0!"}},{"$f":"SUM(S45:S54)","v":0}]

{"sheet":"調節計算結果","index":11,"n_rows":7,"n_cols":9,"rows_kept":7,"cut":false,"hidden":false,"merged":[]}
[null,null,null,null,null,null,null,null,"【提出様式】"]
["調節計算結果（流量ハイドログラフ）　　"]
[null,"【貯留量】"]
[null,"計画貯留施設容量",{"$f":"MAX('施設諸元（自然調節）'!C14:C63)","v":0},"m3","≧","必要貯留施設容量",{"$f":"'コントロールシート（貯留＋浸透）'!G15","v":0},"m3",{"$f":"IF(C4>=G4,\"OK\",\"NG\")","v":"OK"}]
[null,"【放流量】"]
[null,"最大流入量（行為後）",{"$f":"事前相談チェックシート!R13","v":{"$error":"#DIV/0!"}},"m3/s"]
[null,"最大放流量",{"$f":"'コントロールシート（貯留＋浸透）'!L18","v":7.91681348704628E-2},"m3/s","≦","許容放流量",{"$f":"事前相談チェックシート!U25","v":99999},"m3/s",{"$f":"IF(C7<=G7,\"OK\",\"NG\")","v":"OK"}]

{"sheet":"許可申請書","index":12,"n_rows":53,"n_cols":10,"rows_kept":53,"cut":false,"hidden":false,"merged":[[22,1,23,1],[22,2,23,5],[6,0,6,8],[9,0,9,8],[12,0,12,3],[18,0,28,0],[18,2,18,5],[18,6,18,10],[19,2,19,5],[19,6,19,10],[20,1,21,1],[20,2,21,5],[13,0,13,3],[27,2,27,5],[27,6,27,10],[28,2,28,5],[25,2,25,5],[42,2,44,10],[30,4,30,10],[31,4,31,6],[31,7,31,10],[33,7,34,10],[36,2,37,10],[39,2,41,10],[29,4,29,6],[29,7,29,10],[25,6,25,10],[26,2,26,5],[26,6,26,10],[28,6,28,10],[14,5,15,8],[16,5,17,8],[20,6,21,10],[22,6,23,10],[24,2,24,5],[24,6,24,10]]}
["別記様式第二（第十六条関係）"]
[null,null,null,null,null,null,"許可申請"]
[null,null,null,null,null,"雨水浸透阻害行為",null,"書"]
[null,null,null,null,null,null,"協　　議"]
[]
[null,null,null,null,"　第３０条",null,null,null,null,"※"]
["　特定都市河川浸水被害対策法　　    　　 の規定により、雨水浸透阻害行為",null,null,null,null,null,null,null,null,"手数料欄"]
[null,null,null,null,"第３５条"]
[null,null," 　　 許可を申請"]
["について　　　　　　 します。"]
[null,null,"　 協　　　議"]
[]
["　　年　　月　　日"]
["　　　　　　　 　殿　 "]
[null,null,null,null,"住所",{"$f":"事前相談書!H17","v":0}]
[]
[null,null,null,null,"氏名",{"$f":"事前相談書!H19","v":0}]
[]
["雨水浸透阻害行為等の概要","１","雨水浸透阻害行為の区域に含まれる地域の名称",null,null,null,{"$f":"事前相談書!G8","v":0}]
[null,"２","雨水浸透阻害行為区域の面積",null,null,null,{"$f":"事前相談チェックシート!R5*10000","v":0}]
[null,"３","雨水浸透阻害行為に関する工事の計画の概要",null,null,null,{"$f":"事前相談書!G14","v":0}]
[]
[null,"４","対策工事の計画の概要"]
[]
[null,"５","雨水浸透阻害行為に関する工事の着手予定日",null,null,null,"　　年　　月　　日"]
[null,"６","雨水浸透阻害行為に関する工事の完了予定日",null,null,null,"　　年　　月　　日"]
[null,"７","対策工事の着手予定日",null,null,null,"　　年　　月　　日"]
[null,"８","対策工事の完了予定日",null,null,null,"　　年　　月　　日"]
[null,"９","その他必要な事項"]
["※受付番号",null,null,null,"　　年　　月　　日",null,null,"第　　　　号"]
["※許可に付した条件"]
["※許可番号",null,null,null,"　　年　　月　　日",null,null,"第　　　　号"]
["備考"]
[null,"１","　「許可申請　、 「第３０ 条   、 「許可を申請",null,null,null,null,"については、該当するものを○で"]
[null,null,"　　協　　議」　   第３５条」　　 協　  　議」"]
[null,null,"囲むこと。"]
[null,"２","　許可申請者が法人である場合においては、氏名は、その法人の名称及び代表者の氏名を記載すること。"]
[]
[null,"３","　※印のある欄は記載しないこと。"]
[null,"４","　雨水浸透阻害行為に関する工事の計画及び対策工事の計画については、概要の記述の末尾に「（計画の詳細は、別葉の計画説明書及び計画図による。）」と記載し、それぞれ計画説明書及び計画図を別葉とすること。"]
[]
[]
[null,"５","　「その他の必要な事項」の欄には、雨水浸透阻害行為を行うことについて、都市計画法、農地法その他の法令による許可、認可等を要する場合には、その手続の状況を記載すること。"]
[]
[]
[]
[]
[]
[]
[]
[]
[]
[null,null,null,"　"]

{"sheet":"計画説明書","index":13,"n_rows":27,"n_cols":11,"rows_kept":27,"cut":false,"hidden":false,"merged":[[21,4,21,6],[21,7,21,10],[22,4,24,6],[22,7,24,10],[25,1,25,10],[26,0,26,10],[21,1,24,3],[19,0,24,0],[1,0,1,10],[9,0,13,0],[9,1,10,1],[9,2,10,2],[9,3,10,3],[9,4,10,4],[2,1,2,10],[3,1,3,10],[4,1,4,10],[5,1,5,10],[6,1,6,10],[7,1,7,10],[8,1,8,10],[14,0,18,0],[14,1,15,1],[14,2,15,2],[14,3,15,3],[14,4,15,4],[19,6,19,8],[19,9,19,10],[20,1,20,3],[20,4,20,5],[20,6,20,8],[20,9,20,10],[19,1,19,3],[19,4,19,5]]}
["様式－１（特定都市河川浸水被害対策法施行規則 第16条関係）"]
["計　画　説　明　書"]
["申請者"]
["設計者"]
["工事施工者"]
["施設管理者"]
["雨水浸透阻害行為の区域に含まれる地域の名称",{"$f":"事前相談書!G8","v":0}]
["雨水浸透阻害行為に関する工事の計画の概要"]
["対策工事の計画の概要"]
["行為区域(対策工事に係る雨水貯留浸透施設の集水区域が行為区域の範囲を超えるときは、当該超える区域を含む。)内の土地の現況(m2)","宅　地","池　沼","水　路","ため池","道　路","道　路","鉄道線路","鉄道線路","飛行場","飛行場"]
[null,null,null,null,null,"(法面無)","(法面有)","(法面無)","(法面有)","(法面無)","(法面有)"]
[null,{"$f":"事前相談入力シート!C23*10000","v":0},{"$f":"事前相談入力シート!D23*10000","v":0},{"$f":"事前相談入力シート!E23*10000","v":0},{"$f":"事前相談入力シート!F23*10000","v":0},{"$f":"事前相談入力シート!G23*10000","v":0},{"$f":"事前相談入力シート!H23*10000","v":0},{"$f":"事前相談入力シート!I23*10000","v":0},{"$f":"事前相談入力シート!J23*10000","v":0},{"$f":"事前相談入力シート!K23*10000","v":0},{"$f":"事前相談入力シート!L23*10000","v":0}]
[null,"太陽光\nパネル","舗装された土地(法面を除く。)","舗装された土地(法面)","ゴルフ場","運動場","締め固められた土地","山　地","植生に覆われた法面","林地・耕地・原野その他","合　計"]
[null,{"$f":"事前相談入力シート!M23*10000","v":0},{"$f":"事前相談入力シート!N23*10000","v":0},{"$f":"事前相談入力シート!O23*10000","v":0},{"$f":"事前相談入力シート!P23*10000","v":0},{"$f":"事前相談入力シート!Q23*10000","v":0},{"$f":"事前相談入力シート!R23*10000","v":0},{"$f":"事前相談入力シート!S23*10000","v":0},{"$f":"事前相談入力シート!T23*10000","v":0},{"$f":"事前相談入力シート!U23*10000","v":0},{"$f":"SUM(B12:K12,B14:J14)","v":0}]
["行為区域(対策工事に係る雨水貯留浸透施設の集水区域が行為区域の範囲を超えるときは、当該超える区域を含む。)内の土地利用計画(m2)","宅　地","池　沼","水　路","ため池","道　路","道　路","鉄道線路","鉄道線路","飛行場","飛行場"]
[null,null,null,null,null,"(法面無)","(法面有)","(法面無)","(法面有)","(法面無)","(法面有)"]
[null,{"$f":"事前相談入力シート!C46*10000","v":0},{"$f":"事前相談入力シート!D46*10000","v":0},{"$f":"事前相談入力シート!E46*10000","v":0},{"$f":"事前相談入力シート!F46*10000","v":0},{"$f":"事前相談入力シート!G46*10000","v":0},{"$f":"事前相談入力シート!H46*10000","v":0},{"$f":"事前相談入力シート!I46*10000","v":0},{"$f":"事前相談入力シート!J46*10000","v":0},{"$f":"事前相談入力シート!K46*10000","v":0},{"$f":"事前相談入力シート!L46*10000","v":0}]
[null,"太陽光\nパネル","舗装された土地(法面を除く。)","舗装された土地(法面)","ゴルフ場","運動場","締め固められた土地","山　地","植生に覆われた法面","林地・耕地・原野その他","合　計"]
[null,{"$f":"事前相談入力シート!M46*10000","v":0},{"$f":"事前相談入力シート!N46*10000","v":0},{"$f":"事前相談入力シート!O46*10000","v":0},{"$f":"事前相談入力シート!P46*10000","v":0},{"$f":"事前相談入力シート!Q46*10000","v":0},{"$f":"事前相談入力シート!R46*10000","v":0},{"$f":"事前相談入力シート!S46*10000","v":0},{"$f":"事前相談入力シート!T46*10000","v":0},{"$f":"事前相談入力シート!U46*10000","v":0},{"$f":"SUM(B17:K17,B19:J19)","v":0}]
["対策工事に係る雨水貯留浸透施設の計画","行為前の流出係数",null,null,{"$f":"事前相談チェックシート!R10","v":{"$error":"#DIV/0!"}},null,"行為後の流出係数",null,null,{"$f":"事前相談チェックシート!R12","v":{"$error":"#DIV/0!"}}]
[null,"行為前の流出雨水量",null,null,{"$f":"事前相談チェックシート!R11","v":{"$error":"#DIV/0!"}},null,"行為後の流出雨水量",null,null,{"$f":"事前相談チェックシート!R13","v":{"$error":"#DIV/0!"}}]
[null,"雨水貯留浸透施設の計画",null,null,"構造名称",null,null,"容量(浸透能力)"]
[]
[]
[]
["その他"]
["備考"]

{"sheet":"mkrain","index":14,"n_rows":147,"n_cols":8,"rows_kept":147,"cut":false,"hidden":true,"merged":[]}
[null,"降雨ハイエト",null,null,null,null,{"$f":"MAX(G4:G147)","v":127}]
[null,"埼玉県南部","埼玉県北部","東京都","茨城県",null,"対象エリア"]
[]
[null,4.0869999999999997,2.9617,4.0747,2.6570999999999998,1,{"$f":"ROUND(IF(事前相談チェックシート!$U$4=mkrain!B$2,mkrain!B4,IF(事前相談チェックシート!$U$4=mkrain!C$2,mkrain!C4,IF(事前相談チェックシート!$U$4=mkrain!D$2,mkrain!D4,mkrain!E4))),1)","v":2.7},"対象エリアによって参照を変更する"]
[null,4.1269,2.9901,4.1143000000000001,2.6827999999999999,2,{"$f":"ROUND(IF(事前相談チェックシート!$U$4=mkrain!B$2,mkrain!B5,IF(事前相談チェックシート!$U$4=mkrain!C$2,mkrain!C5,IF(事前相談チェックシート!$U$4=mkrain!D$2,mkrain!D5,mkrain!E5))),1)","v":2.7}]
[null,4.1677,3.0192000000000001,4.1548999999999996,2.7090999999999998,3,{"$f":"ROUND(IF(事前相談チェックシート!$U$4=mkrain!B$2,mkrain!B6,IF(事前相談チェックシート!$U$4=mkrain!C$2,mkrain!C6,IF(事前相談チェックシート!$U$4=mkrain!D$2,mkrain!D6,mkrain!E6))),1)","v":2.7}]
[null,4.2096,3.0489999999999999,4.1966000000000001,2.7361,4,{"$f":"ROUND(IF(事前相談チェックシート!$U$4=mkrain!B$2,mkrain!B7,IF(事前相談チェックシート!$U$4=mkrain!C$2,mkrain!C7,IF(事前相談チェックシート!$U$4=mkrain!D$2,mkrain!D7,mkrain!E7))),1)","v":2.7}]
[null,4.2525000000000004,3.0794999999999999,4.2393000000000001,2.7637999999999998,5,{"$f":"ROUND(IF(事前相談チェックシート!$U$4=mkrain!B$2,mkrain!B8,IF(事前相談チェックシート!$U$4=mkrain!C$2,mkrain!C8,IF(事前相談チェックシート!$U$4=mkrain!D$2,mkrain!D8,mkrain!E8))),1)","v":2.8}]
[null,4.2965,3.1107999999999998,4.2830000000000004,2.7921,6,{"$f":"ROUND(IF(事前相談チェックシート!$U$4=mkrain!B$2,mkrain!B9,IF(事前相談チェックシート!$U$4=mkrain!C$2,mkrain!C9,IF(事前相談チェックシート!$U$4=mkrain!D$2,mkrain!D9,mkrain!E9))),1)","v":2.8}]
[null,4.3417000000000003,3.1429999999999998,4.3280000000000003,2.8212000000000002,7,{"$f":"ROUND(IF(事前相談チェックシート!$U$4=mkrain!B$2,mkrain!B10,IF(事前相談チェックシート!$U$4=mkrain!C$2,mkrain!C10,IF(事前相談チェックシート!$U$4=mkrain!D$2,mkrain!D10,mkrain!E10))),1)","v":2.8}]
[null,4.3879999999999999,3.1760000000000002,4.3741000000000003,2.8511000000000002,8,{"$f":"ROUND(IF(事前相談チェックシート!$U$4=mkrain!B$2,mkrain!B11,IF(事前相談チェックシート!$U$4=mkrain!C$2,mkrain!C11,IF(事前相談チェックシート!$U$4=mkrain!D$2,mkrain!D11,mkrain!E11))),1)","v":2.9}]
[null,4.4356,3.2098,4.4214000000000002,2.8816999999999999,9,{"$f":"ROUND(IF(事前相談チェックシート!$U$4=mkrain!B$2,mkrain!B12,IF(事前相談チェックシート!$U$4=mkrain!C$2,mkrain!C12,IF(事前相談チェックシート!$U$4=mkrain!D$2,mkrain!D12,mkrain!E12))),1)","v":2.9}]
[null,4.4844999999999997,3.2446000000000002,4.47,2.9131999999999998,10,{"$f":"ROUND(IF(事前相談チェックシート!$U$4=mkrain!B$2,mkrain!B13,IF(事前相談チェックシート!$U$4=mkrain!C$2,mkrain!C13,IF(事前相談チェックシート!$U$4=mkrain!D$2,mkrain!D13,mkrain!E13))),1)","v":2.9}]
[null,4.5347999999999997,3.2803,4.5199999999999996,2.9456000000000002,11,{"$f":"ROUND(IF(事前相談チェックシート!$U$4=mkrain!B$2,mkrain!B14,IF(事前相談チェックシート!$U$4=mkrain!C$2,mkrain!C14,IF(事前相談チェックシート!$U$4=mkrain!D$2,mkrain!D14,mkrain!E14))),1)","v":2.9}]
[null,4.5864000000000003,3.3170000000000002,4.5713999999999997,2.9788999999999999,12,{"$f":"ROUND(IF(事前相談チェックシート!$U$4=mkrain!B$2,mkrain!B15,IF(事前相談チェックシート!$U$4=mkrain!C$2,mkrain!C15,IF(事前相談チェックシート!$U$4=mkrain!D$2,mkrain!D15,mkrain!E15))),1)","v":3}]
[null,4.6395999999999997,3.3548,4.6242000000000001,3.0131000000000001,13,{"$f":"ROUND(IF(事前相談チェックシート!$U$4=mkrain!B$2,mkrain!B16,IF(事前相談チェックシート!$U$4=mkrain!C$2,mkrain!C16,IF(事前相談チェックシート!$U$4=mkrain!D$2,mkrain!D16,mkrain!E16))),1)","v":3}]
[null,4.6943000000000001,3.3936000000000002,4.6786000000000003,3.0482999999999998,14,{"$f":"ROUND(IF(事前相談チェックシート!$U$4=mkrain!B$2,mkrain!B17,IF(事前相談チェックシート!$U$4=mkrain!C$2,mkrain!C17,IF(事前相談チェックシート!$U$4=mkrain!D$2,mkrain!D17,mkrain!E17))),1)","v":3}]
[null,4.7506000000000004,3.4336000000000002,4.7346000000000004,3.0844999999999998,15,{"$f":"ROUND(IF(事前相談チェックシート!$U$4=mkrain!B$2,mkrain!B18,IF(事前相談チェックシート!$U$4=mkrain!C$2,mkrain!C18,IF(事前相談チェックシート!$U$4=mkrain!D$2,mkrain!D18,mkrain!E18))),1)","v":3.1}]
[null,4.8086000000000002,3.4748000000000001,4.7923,3.1219000000000001,16,{"$f":"ROUND(IF(事前相談チェックシート!$U$4=mkrain!B$2,mkrain!B19,IF(事前相談チェックシート!$U$4=mkrain!C$2,mkrain!C19,IF(事前相談チェックシート!$U$4=mkrain!D$2,mkrain!D19,mkrain!E19))),1)","v":3.1}]
[null,4.8684000000000003,3.5171999999999999,4.8517999999999999,3.1602999999999999,17,{"$f":"ROUND(IF(事前相談チェックシート!$U$4=mkrain!B$2,mkrain!B20,IF(事前相談チェックシート!$U$4=mkrain!C$2,mkrain!C20,IF(事前相談チェックシート!$U$4=mkrain!D$2,mkrain!D20,mkrain!E20))),1)","v":3.2}]
[null,4.9301000000000004,3.5609000000000002,4.9131,3.2,18,{"$f":"ROUND(IF(事前相談チェックシート!$U$4=mkrain!B$2,mkrain!B21,IF(事前相談チェックシート!$U$4=mkrain!C$2,mkrain!C21,IF(事前相談チェックシート!$U$4=mkrain!D$2,mkrain!D21,mkrain!E21))),1)","v":3.2}]
[null,4.9936999999999996,3.6059999999999999,4.9763999999999999,3.2410000000000001,19,{"$f":"ROUND(IF(事前相談チェックシート!$U$4=mkrain!B$2,mkrain!B22,IF(事前相談チェックシート!$U$4=mkrain!C$2,mkrain!C22,IF(事前相談チェックシート!$U$4=mkrain!D$2,mkrain!D22,mkrain!E22))),1)","v":3.2}]
[null,5.0594000000000001,3.6526000000000001,5.0416999999999996,3.2831999999999999,20,{"$f":"ROUND(IF(事前相談チェックシート!$U$4=mkrain!B$2,mkrain!B23,IF(事前相談チェックシート!$U$4=mkrain!C$2,mkrain!C23,IF(事前相談チェックシート!$U$4=mkrain!D$2,mkrain!D23,mkrain!E23))),1)","v":3.3}]
[null,5.1273,3.7006999999999999,5.1092000000000004,3.3269000000000002,21,{"$f":"ROUND(IF(事前相談チェックシート!$U$4=mkrain!B$2,mkrain!B24,IF(事前相談チェックシート!$U$4=mkrain!C$2,mkrain!C24,IF(事前相談チェックシート!$U$4=mkrain!D$2,mkrain!D24,mkrain!E24))),1)","v":3.3}]
[null,5.1974999999999998,3.7504,5.1790000000000003,3.3719999999999999,22,{"$f":"ROUND(IF(事前相談チェックシート!$U$4=mkrain!B$2,mkrain!B25,IF(事前相談チェックシート!$U$4=mkrain!C$2,mkrain!C25,IF(事前相談チェックシート!$U$4=mkrain!D$2,mkrain!D25,mkrain!E25))),1)","v":3.4}]
[null,5.2701000000000002,3.8018000000000001,5.2511999999999999,3.4186999999999999,23,{"$f":"ROUND(IF(事前相談チェックシート!$U$4=mkrain!B$2,mkrain!B26,IF(事前相談チェックシート!$U$4=mkrain!C$2,mkrain!C26,IF(事前相談チェックシート!$U$4=mkrain!D$2,mkrain!D26,mkrain!E26))),1)","v":3.4}]
[null,5.3452999999999999,3.855,5.3258999999999999,3.4670000000000001,24,{"$f":"ROUND(IF(事前相談チェックシート!$U$4=mkrain!B$2,mkrain!B27,IF(事前相談チェックシート!$U$4=mkrain!C$2,mkrain!C27,IF(事前相談チェックシート!$U$4=mkrain!D$2,mkrain!D27,mkrain!E27))),1)","v":3.5}]
[null,5.4231999999999996,3.9100999999999999,5.4032999999999998,3.5171000000000001,25,{"$f":"ROUND(IF(事前相談チェックシート!$U$4=mkrain!B$2,mkrain!B28,IF(事前相談チェックシート!$U$4=mkrain!C$2,mkrain!C28,IF(事前相談チェックシート!$U$4=mkrain!D$2,mkrain!D28,mkrain!E28))),1)","v":3.5}]
[null,5.5038999999999998,3.9672000000000001,5.4836,3.5689000000000002,26,{"$f":"ROUND(IF(事前相談チェックシート!$U$4=mkrain!B$2,mkrain!B29,IF(事前相談チェックシート!$U$4=mkrain!C$2,mkrain!C29,IF(事前相談チェックシート!$U$4=mkrain!D$2,mkrain!D29,mkrain!E29))),1)","v":3.6}]
[null,5.5876999999999999,4.0265000000000004,5.5667999999999997,3.6227,27,{"$f":"ROUND(IF(事前相談チェックシート!$U$4=mkrain!B$2,mkrain!B30,IF(事前相談チェックシート!$U$4=mkrain!C$2,mkrain!C30,IF(事前相談チェックシート!$U$4=mkrain!D$2,mkrain!D30,mkrain!E30))),1)","v":3.6}]
[null,5.6746999999999996,4.0879000000000003,5.6532999999999998,3.6785999999999999,28,{"$f":"ROUND(IF(事前相談チェックシート!$U$4=mkrain!B$2,mkrain!B31,IF(事前相談チェックシート!$U$4=mkrain!C$2,mkrain!C31,IF(事前相談チェックシート!$U$4=mkrain!D$2,mkrain!D31,mkrain!E31))),1)","v":3.7}]
[null,5.7651000000000003,4.1517999999999997,5.7431000000000001,3.7366999999999999,29,{"$f":"ROUND(IF(事前相談チェックシート!$U$4=mkrain!B$2,mkrain!B32,IF(事前相談チェックシート!$U$4=mkrain!C$2,mkrain!C32,IF(事前相談チェックシート!$U$4=mkrain!D$2,mkrain!D32,mkrain!E32))),1)","v":3.7}]
[null,5.8590999999999998,4.2182000000000004,5.8365999999999998,3.7970999999999999,30,{"$f":"ROUND(IF(事前相談チェックシート!$U$4=mkrain!B$2,mkrain!B33,IF(事前相談チェックシート!$U$4=mkrain!C$2,mkrain!C33,IF(事前相談チェックシート!$U$4=mkrain!D$2,mkrain!D33,mkrain!E33))),1)","v":3.8}]
[null,5.9570999999999996,4.2873000000000001,5.9339000000000004,3.8599000000000001,31,{"$f":"ROUND(IF(事前相談チェックシート!$U$4=mkrain!B$2,mkrain!B34,IF(事前相談チェックシート!$U$4=mkrain!C$2,mkrain!C34,IF(事前相談チェックシート!$U$4=mkrain!D$2,mkrain!D34,mkrain!E34))),1)","v":3.9}]
[null,6.0590999999999999,4.3593000000000002,6.0354000000000001,3.9253999999999998,32,{"$f":"ROUND(IF(事前相談チェックシート!$U$4=mkrain!B$2,mkrain!B35,IF(事前相談チェックシート!$U$4=mkrain!C$2,mkrain!C35,IF(事前相談チェックシート!$U$4=mkrain!D$2,mkrain!D35,mkrain!E35))),1)","v":3.9}]
[null,6.1656000000000004,4.4344000000000001,6.1412000000000004,3.9937999999999998,33,{"$f":"ROUND(IF(事前相談チェックシート!$U$4=mkrain!B$2,mkrain!B36,IF(事前相談チェックシート!$U$4=mkrain!C$2,mkrain!C36,IF(事前相談チェックシート!$U$4=mkrain!D$2,mkrain!D36,mkrain!E36))),1)","v":4}]
[null,6.2767999999999997,4.5126999999999997,6.2516999999999996,4.0651000000000002,34,{"$f":"ROUND(IF(事前相談チェックシート!$U$4=mkrain!B$2,mkrain!B37,IF(事前相談チェックシート!$U$4=mkrain!C$2,mkrain!C37,IF(事前相談チェックシート!$U$4=mkrain!D$2,mkrain!D37,mkrain!E37))),1)","v":4.0999999999999996}]
[null,6.3930999999999996,4.5946999999999996,6.3673000000000002,4.1397000000000004,35,{"$f":"ROUND(IF(事前相談チェックシート!$U$4=mkrain!B$2,mkrain!B38,IF(事前相談チェックシート!$U$4=mkrain!C$2,mkrain!C38,IF(事前相談チェックシート!$U$4=mkrain!D$2,mkrain!D38,mkrain!E38))),1)","v":4.0999999999999996}]
[null,6.5148999999999999,4.6803999999999997,6.4882,4.2178000000000004,36,{"$f":"ROUND(IF(事前相談チェックシート!$U$4=mkrain!B$2,mkrain!B39,IF(事前相談チェックシート!$U$4=mkrain!C$2,mkrain!C39,IF(事前相談チェックシート!$U$4=mkrain!D$2,mkrain!D39,mkrain!E39))),1)","v":4.2}]
[null,6.6425000000000001,4.7702,6.6150000000000002,4.2996999999999996,37,{"$f":"ROUND(IF(事前相談チェックシート!$U$4=mkrain!B$2,mkrain!B40,IF(事前相談チェックシート!$U$4=mkrain!C$2,mkrain!C40,IF(事前相談チェックシート!$U$4=mkrain!D$2,mkrain!D40,mkrain!E40))),1)","v":4.3}]
[null,6.7765000000000004,4.8643999999999998,6.7481999999999998,4.3855000000000004,38,{"$f":"ROUND(IF(事前相談チェックシート!$U$4=mkrain!B$2,mkrain!B41,IF(事前相談チェックシート!$U$4=mkrain!C$2,mkrain!C41,IF(事前相談チェックシート!$U$4=mkrain!D$2,mkrain!D41,mkrain!E41))),1)","v":4.4000000000000004}]
[null,6.9173,4.9634,6.8880999999999997,4.4757999999999996,39,{"$f":"ROUND(IF(事前相談チェックシート!$U$4=mkrain!B$2,mkrain!B42,IF(事前相談チェックシート!$U$4=mkrain!C$2,mkrain!C42,IF(事前相談チェックシート!$U$4=mkrain!D$2,mkrain!D42,mkrain!E42))),1)","v":4.5}]
[null,7.0655000000000001,5.0675999999999997,7.0353000000000003,4.5708000000000002,40,{"$f":"ROUND(IF(事前相談チェックシート!$U$4=mkrain!B$2,mkrain!B43,IF(事前相談チェックシート!$U$4=mkrain!C$2,mkrain!C43,IF(事前相談チェックシート!$U$4=mkrain!D$2,mkrain!D43,mkrain!E43))),1)","v":4.5999999999999996}]
[null,7.2218,5.1773999999999996,7.1905999999999999,4.6710000000000003,41,{"$f":"ROUND(IF(事前相談チェックシート!$U$4=mkrain!B$2,mkrain!B44,IF(事前相談チェックシート!$U$4=mkrain!C$2,mkrain!C44,IF(事前相談チェックシート!$U$4=mkrain!D$2,mkrain!D44,mkrain!E44))),1)","v":4.7}]
[null,7.3868999999999998,5.2933000000000003,7.3547000000000002,4.7766999999999999,42,{"$f":"ROUND(IF(事前相談チェックシート!$U$4=mkrain!B$2,mkrain!B45,IF(事前相談チェックシート!$U$4=mkrain!C$2,mkrain!C45,IF(事前相談チェックシート!$U$4=mkrain!D$2,mkrain!D45,mkrain!E45))),1)","v":4.8}]
[null,7.5616000000000003,5.4157999999999999,7.5282,4.8886000000000003,43,{"$f":"ROUND(IF(事前相談チェックシート!$U$4=mkrain!B$2,mkrain!B46,IF(事前相談チェックシート!$U$4=mkrain!C$2,mkrain!C46,IF(事前相談チェックシート!$U$4=mkrain!D$2,mkrain!D46,mkrain!E46))),1)","v":4.9000000000000004}]
[null,7.7468000000000004,5.5457000000000001,7.7122000000000002,5.0072000000000001,44,{"$f":"ROUND(IF(事前相談チェックシート!$U$4=mkrain!B$2,mkrain!B47,IF(事前相談チェックシート!$U$4=mkrain!C$2,mkrain!C47,IF(事前相談チェックシート!$U$4=mkrain!D$2,mkrain!D47,mkrain!E47))),1)","v":5}]
[null,7.9436,5.6836000000000002,7.9076000000000004,5.1332000000000004,45,{"$f":"ROUND(IF(事前相談チェックシート!$U$4=mkrain!B$2,mkrain!B48,IF(事前相談チェックシート!$U$4=mkrain!C$2,mkrain!C48,IF(事前相談チェックシート!$U$4=mkrain!D$2,mkrain!D48,mkrain!E48))),1)","v":5.0999999999999996}]
[null,8.1531000000000002,5.8303000000000003,8.1158000000000001,5.2674000000000003,46,{"$f":"ROUND(IF(事前相談チェックシート!$U$4=mkrain!B$2,mkrain!B49,IF(事前相談チェックシート!$U$4=mkrain!C$2,mkrain!C49,IF(事前相談チェックシート!$U$4=mkrain!D$2,mkrain!D49,mkrain!E49))),1)","v":5.3}]
[null,8.3766999999999996,5.9867999999999997,8.3378999999999994,5.4104999999999999,47,{"$f":"ROUND(IF(事前相談チェックシート!$U$4=mkrain!B$2,mkrain!B50,IF(事前相談チェックシート!$U$4=mkrain!C$2,mkrain!C50,IF(事前相談チェックシート!$U$4=mkrain!D$2,mkrain!D50,mkrain!E50))),1)","v":5.4}]
[null,8.6159999999999997,6.1542000000000003,8.5755999999999997,5.5636000000000001,48,{"$f":"ROUND(IF(事前相談チェックシート!$U$4=mkrain!B$2,mkrain!B51,IF(事前相談チェックシート!$U$4=mkrain!C$2,mkrain!C51,IF(事前相談チェックシート!$U$4=mkrain!D$2,mkrain!D51,mkrain!E51))),1)","v":5.6}]
[null,8.8727,6.3337000000000003,8.8306000000000004,5.7279,49,{"$f":"ROUND(IF(事前相談チェックシート!$U$4=mkrain!B$2,mkrain!B52,IF(事前相談チェックシート!$U$4=mkrain!C$2,mkrain!C52,IF(事前相談チェックシート!$U$4=mkrain!D$2,mkrain!D52,mkrain!E52))),1)","v":5.7}]
[null,9.1491000000000007,6.5267999999999997,9.1051000000000002,5.9047000000000001,50,{"$f":"ROUND(IF(事前相談チェックシート!$U$4=mkrain!B$2,mkrain!B53,IF(事前相談チェックシート!$U$4=mkrain!C$2,mkrain!C53,IF(事前相談チェックシート!$U$4=mkrain!D$2,mkrain!D53,mkrain!E53))),1)","v":5.9}]
[null,9.4474999999999998,6.7351999999999999,9.4016000000000002,6.0956000000000001,51,{"$f":"ROUND(IF(事前相談チェックシート!$U$4=mkrain!B$2,mkrain!B54,IF(事前相談チェックシート!$U$4=mkrain!C$2,mkrain!C54,IF(事前相談チェックシート!$U$4=mkrain!D$2,mkrain!D54,mkrain!E54))),1)","v":6.1}]
[null,9.7708999999999993,6.9608999999999996,9.7227999999999994,6.3025000000000002,52,{"$f":"ROUND(IF(事前相談チェックシート!$U$4=mkrain!B$2,mkrain!B55,IF(事前相談チェックシート!$U$4=mkrain!C$2,mkrain!C55,IF(事前相談チェックシート!$U$4=mkrain!D$2,mkrain!D55,mkrain!E55))),1)","v":6.3}]
[null,10.1229,7.2064000000000004,10.0725,6.5277000000000003,53,{"$f":"ROUND(IF(事前相談チェックシート!$U$4=mkrain!B$2,mkrain!B56,IF(事前相談チェックシート!$U$4=mkrain!C$2,mkrain!C56,IF(事前相談チェックシート!$U$4=mkrain!D$2,mkrain!D56,mkrain!E56))),1)","v":6.5}]
[null,10.5075,7.4745999999999997,10.454599999999999,6.7736999999999998,54,{"$f":"ROUND(IF(事前相談チェックシート!$U$4=mkrain!B$2,mkrain!B57,IF(事前相談チェックシート!$U$4=mkrain!C$2,mkrain!C57,IF(事前相談チェックシート!$U$4=mkrain!D$2,mkrain!D57,mkrain!E57))),1)","v":6.8}]
[null,10.9299,7.7689000000000004,10.8742,7.0438999999999998,55,{"$f":"ROUND(IF(事前相談チェックシート!$U$4=mkrain!B$2,mkrain!B58,IF(事前相談チェックシート!$U$4=mkrain!C$2,mkrain!C58,IF(事前相談チェックシート!$U$4=mkrain!D$2,mkrain!D58,mkrain!E58))),1)","v":7}]
[null,11.3962,8.0937000000000001,11.3376,7.3422000000000001,56,{"$f":"ROUND(IF(事前相談チェックシート!$U$4=mkrain!B$2,mkrain!B59,IF(事前相談チェックシート!$U$4=mkrain!C$2,mkrain!C59,IF(事前相談チェックシート!$U$4=mkrain!D$2,mkrain!D59,mkrain!E59))),1)","v":7.3}]
[null,11.914300000000001,8.4544999999999995,11.852399999999999,7.6737000000000002,57,{"$f":"ROUND(IF(事前相談チェックシート!$U$4=mkrain!B$2,mkrain!B60,IF(事前相談チェックシート!$U$4=mkrain!C$2,mkrain!C60,IF(事前相談チェックシート!$U$4=mkrain!D$2,mkrain!D60,mkrain!E60))),1)","v":7.7}]
[null,12.4937,8.8577999999999992,12.4283,8.0446000000000009,58,{"$f":"ROUND(IF(事前相談チェックシート!$U$4=mkrain!B$2,mkrain!B61,IF(事前相談チェックシート!$U$4=mkrain!C$2,mkrain!C61,IF(事前相談チェックシート!$U$4=mkrain!D$2,mkrain!D61,mkrain!E61))),1)","v":8}]
[null,13.1469,9.3124000000000002,13.077500000000001,8.4627999999999997,59,{"$f":"ROUND(IF(事前相談チェックシート!$U$4=mkrain!B$2,mkrain!B62,IF(事前相談チェックシート!$U$4=mkrain!C$2,mkrain!C62,IF(事前相談チェックシート!$U$4=mkrain!D$2,mkrain!D62,mkrain!E62))),1)","v":8.5}]
[null,13.889799999999999,9.8294999999999995,13.8162,8.9387000000000008,60,{"$f":"ROUND(IF(事前相談チェックシート!$U$4=mkrain!B$2,mkrain!B63,IF(事前相談チェックシート!$U$4=mkrain!C$2,mkrain!C63,IF(事前相談チェックシート!$U$4=mkrain!D$2,mkrain!D63,mkrain!E63))),1)","v":8.9}]
[null,14.743499999999999,10.4239,14.6653,9.4861000000000004,61,{"$f":"ROUND(IF(事前相談チェックシート!$U$4=mkrain!B$2,mkrain!B64,IF(事前相談チェックシート!$U$4=mkrain!C$2,mkrain!C64,IF(事前相談チェックシート!$U$4=mkrain!D$2,mkrain!D64,mkrain!E64))),1)","v":9.5}]
[null,15.736700000000001,11.1158,15.653600000000001,10.1236,62,{"$f":"ROUND(IF(事前相談チェックシート!$U$4=mkrain!B$2,mkrain!B65,IF(事前相談チェックシート!$U$4=mkrain!C$2,mkrain!C65,IF(事前相談チェックシート!$U$4=mkrain!D$2,mkrain!D65,mkrain!E65))),1)","v":10.1}]
[null,16.909099999999999,11.9335,16.820699999999999,10.8772,63,{"$f":"ROUND(IF(事前相談チェックシート!$U$4=mkrain!B$2,mkrain!B66,IF(事前相談チェックシート!$U$4=mkrain!C$2,mkrain!C66,IF(事前相談チェックシート!$U$4=mkrain!D$2,mkrain!D66,mkrain!E66))),1)","v":10.9}]
[null,18.317499999999999,12.9176,18.223800000000001,11.7844,64,{"$f":"ROUND(IF(事前相談チェックシート!$U$4=mkrain!B$2,mkrain!B67,IF(事前相談チェックシート!$U$4=mkrain!C$2,mkrain!C67,IF(事前相談チェックシート!$U$4=mkrain!D$2,mkrain!D67,mkrain!E67))),1)","v":11.8}]
[null,20.046700000000001,14.129300000000001,19.948,12.901199999999999,65,{"$f":"ROUND(IF(事前相談チェックシート!$U$4=mkrain!B$2,mkrain!B68,IF(事前相談チェックシート!$U$4=mkrain!C$2,mkrain!C68,IF(事前相談チェックシート!$U$4=mkrain!D$2,mkrain!D68,mkrain!E68))),1)","v":12.9}]
[null,22.229099999999999,15.6655,22.126999999999999,14.3164,66,{"$f":"ROUND(IF(事前相談チェックシート!$U$4=mkrain!B$2,mkrain!B69,IF(事前相談チェックシート!$U$4=mkrain!C$2,mkrain!C69,IF(事前相談チェックシート!$U$4=mkrain!D$2,mkrain!D69,mkrain!E69))),1)","v":14.3}]
[null,25.085100000000001,17.690000000000001,24.983499999999999,16.178999999999998,67,{"$f":"ROUND(IF(事前相談チェックシート!$U$4=mkrain!B$2,mkrain!B70,IF(事前相談チェックシート!$U$4=mkrain!C$2,mkrain!C70,IF(事前相談チェックシート!$U$4=mkrain!D$2,mkrain!D70,mkrain!E70))),1)","v":16.2}]
[null,29.012899999999998,20.505800000000001,28.922000000000001,18.762599999999999,68,{"$f":"ROUND(IF(事前相談チェックシート!$U$4=mkrain!B$2,mkrain!B71,IF(事前相談チェックシート!$U$4=mkrain!C$2,mkrain!C71,IF(事前相談チェックシート!$U$4=mkrain!D$2,mkrain!D71,mkrain!E71))),1)","v":18.8}]
[null,34.82,24.7499,34.7682,22.634899999999998,69,{"$f":"ROUND(IF(事前相談チェックシート!$U$4=mkrain!B$2,mkrain!B72,IF(事前相談チェックシート!$U$4=mkrain!C$2,mkrain!C72,IF(事前相談チェックシート!$U$4=mkrain!D$2,mkrain!D72,mkrain!E72))),1)","v":22.6}]
[null,44.465800000000002,32.059399999999997,44.544400000000003,29.223600000000001,70,{"$f":"ROUND(IF(事前相談チェックシート!$U$4=mkrain!B$2,mkrain!B73,IF(事前相談チェックシート!$U$4=mkrain!C$2,mkrain!C73,IF(事前相談チェックシート!$U$4=mkrain!D$2,mkrain!D73,mkrain!E73))),1)","v":29.2}]
[null,64.504400000000004,48.560499999999998,65.132000000000005,43.628399999999999,71,{"$f":"ROUND(IF(事前相談チェックシート!$U$4=mkrain!B$2,mkrain!B74,IF(事前相談チェックシート!$U$4=mkrain!C$2,mkrain!C74,IF(事前相談チェックシート!$U$4=mkrain!D$2,mkrain!D74,mkrain!E74))),1)","v":43.6}]
[null,155.57599999999999,172.3177,164.08529999999999,127.002,72,{"$f":"ROUND(IF(事前相談チェックシート!$U$4=mkrain!B$2,mkrain!B75,IF(事前相談チェックシート!$U$4=mkrain!C$2,mkrain!C75,IF(事前相談チェックシート!$U$4=mkrain!D$2,mkrain!D75,mkrain!E75))),1)","v":127}]
[null,86.984200000000001,69.827200000000005,88.694000000000003,61.113900000000001,73,{"$f":"ROUND(IF(事前相談チェックシート!$U$4=mkrain!B$2,mkrain!B76,IF(事前相談チェックシート!$U$4=mkrain!C$2,mkrain!C76,IF(事前相談チェックシート!$U$4=mkrain!D$2,mkrain!D76,mkrain!E76))),1)","v":61.1}]
[null,52.301299999999998,38.279200000000003,52.548999999999999,34.7346,74,{"$f":"ROUND(IF(事前相談チェックシート!$U$4=mkrain!B$2,mkrain!B77,IF(事前相談チェックシート!$U$4=mkrain!C$2,mkrain!C77,IF(事前相談チェックシート!$U$4=mkrain!D$2,mkrain!D77,mkrain!E77))),1)","v":34.700000000000003}]
[null,38.9467,27.834099999999999,38.940399999999997,25.428599999999999,75,{"$f":"ROUND(IF(事前相談チェックシート!$U$4=mkrain!B$2,mkrain!B78,IF(事前相談チェックシート!$U$4=mkrain!C$2,mkrain!C78,IF(事前相談チェックシート!$U$4=mkrain!D$2,mkrain!D78,mkrain!E78))),1)","v":25.4}]
[null,31.602,22.385200000000001,31.524999999999999,20.480899999999998,76,{"$f":"ROUND(IF(事前相談チェックシート!$U$4=mkrain!B$2,mkrain!B79,IF(事前相談チェックシート!$U$4=mkrain!C$2,mkrain!C79,IF(事前相談チェックシート!$U$4=mkrain!D$2,mkrain!D79,mkrain!E79))),1)","v":20.5}]
[null,26.878699999999998,18.9709,26.7805,17.355399999999999,77,{"$f":"ROUND(IF(事前相談チェックシート!$U$4=mkrain!B$2,mkrain!B80,IF(事前相談チェックシート!$U$4=mkrain!C$2,mkrain!C80,IF(事前相談チェックシート!$U$4=mkrain!D$2,mkrain!D80,mkrain!E80))),1)","v":17.399999999999999}]
[null,23.553799999999999,16.6023,23.4512,15.178800000000001,78,{"$f":"ROUND(IF(事前相談チェックシート!$U$4=mkrain!B$2,mkrain!B81,IF(事前相談チェックシート!$U$4=mkrain!C$2,mkrain!C81,IF(事前相談チェックシート!$U$4=mkrain!D$2,mkrain!D81,mkrain!E81))),1)","v":15.2}]
[null,21.0702,14.848699999999999,20.9695,13.5641,79,{"$f":"ROUND(IF(事前相談チェックシート!$U$4=mkrain!B$2,mkrain!B82,IF(事前相談チェックシート!$U$4=mkrain!C$2,mkrain!C82,IF(事前相談チェックシート!$U$4=mkrain!D$2,mkrain!D82,mkrain!E82))),1)","v":13.6}]
[null,19.135100000000001,13.49,19.038900000000002,12.311999999999999,80,{"$f":"ROUND(IF(事前相談チェックシート!$U$4=mkrain!B$2,mkrain!B83,IF(事前相談チェックシート!$U$4=mkrain!C$2,mkrain!C83,IF(事前相談チェックシート!$U$4=mkrain!D$2,mkrain!D83,mkrain!E83))),1)","v":12.3}]
[null,17.5793,12.4015,17.488299999999999,11.3086,81,{"$f":"ROUND(IF(事前相談チェックシート!$U$4=mkrain!B$2,mkrain!B84,IF(事前相談チェックシート!$U$4=mkrain!C$2,mkrain!C84,IF(事前相談チェックシート!$U$4=mkrain!D$2,mkrain!D84,mkrain!E84))),1)","v":11.3}]
[null,16.297499999999999,11.5067,16.2117,10.4839,82,{"$f":"ROUND(IF(事前相談チェックシート!$U$4=mkrain!B$2,mkrain!B85,IF(事前相談チェックシート!$U$4=mkrain!C$2,mkrain!C85,IF(事前相談チェックシート!$U$4=mkrain!D$2,mkrain!D85,mkrain!E85))),1)","v":10.5}]
[null,15.220499999999999,10.7561,15.139900000000001,9.7921999999999993,83,{"$f":"ROUND(IF(事前相談チェックシート!$U$4=mkrain!B$2,mkrain!B86,IF(事前相談チェックシート!$U$4=mkrain!C$2,mkrain!C86,IF(事前相談チェックシート!$U$4=mkrain!D$2,mkrain!D86,mkrain!E86))),1)","v":9.8000000000000007}]
[null,14.3012,10.1159,14.2254,9.2025000000000006,84,{"$f":"ROUND(IF(事前相談チェックシート!$U$4=mkrain!B$2,mkrain!B87,IF(事前相談チェックシート!$U$4=mkrain!C$2,mkrain!C87,IF(事前相談チェックシート!$U$4=mkrain!D$2,mkrain!D87,mkrain!E87))),1)","v":9.1999999999999993}]
[null,13.5059,9.5623000000000005,13.4345,8.6928000000000001,85,{"$f":"ROUND(IF(事前相談チェックシート!$U$4=mkrain!B$2,mkrain!B88,IF(事前相談チェックシート!$U$4=mkrain!C$2,mkrain!C88,IF(事前相談チェックシート!$U$4=mkrain!D$2,mkrain!D88,mkrain!E88))),1)","v":8.6999999999999993}]
[null,12.8102,9.0780999999999992,12.742800000000001,8.2471999999999994,86,{"$f":"ROUND(IF(事前相談チェックシート!$U$4=mkrain!B$2,mkrain!B89,IF(事前相談チェックシート!$U$4=mkrain!C$2,mkrain!C89,IF(事前相談チェックシート!$U$4=mkrain!D$2,mkrain!D89,mkrain!E89))),1)","v":8.1999999999999993}]
[null,12.195600000000001,8.6502999999999997,12.132,7.8537999999999997,87,{"$f":"ROUND(IF(事前相談チェックシート!$U$4=mkrain!B$2,mkrain!B90,IF(事前相談チェックシート!$U$4=mkrain!C$2,mkrain!C90,IF(事前相談チェックシート!$U$4=mkrain!D$2,mkrain!D90,mkrain!E90))),1)","v":7.9}]
[null,11.648199999999999,8.2691999999999997,11.587999999999999,7.5034999999999998,88,{"$f":"ROUND(IF(事前相談チェックシート!$U$4=mkrain!B$2,mkrain!B91,IF(事前相談チェックシート!$U$4=mkrain!C$2,mkrain!C91,IF(事前相談チェックシート!$U$4=mkrain!D$2,mkrain!D91,mkrain!E91))),1)","v":7.5}]
[null,11.1571,7.9272,11.1,7.1891999999999996,89,{"$f":"ROUND(IF(事前相談チェックシート!$U$4=mkrain!B$2,mkrain!B92,IF(事前相談チェックシート!$U$4=mkrain!C$2,mkrain!C92,IF(事前相談チェックシート!$U$4=mkrain!D$2,mkrain!D92,mkrain!E92))),1)","v":7.2}]
[null,10.7136,7.6181999999999999,10.6593,6.9055,90,{"$f":"ROUND(IF(事前相談チェックシート!$U$4=mkrain!B$2,mkrain!B93,IF(事前相談チェックシート!$U$4=mkrain!C$2,mkrain!C93,IF(事前相談チェックシート!$U$4=mkrain!D$2,mkrain!D93,mkrain!E93))),1)","v":6.9}]
[null,10.3108,7.3375000000000004,10.2592,6.6478999999999999,91,{"$f":"ROUND(IF(事前相談チェックシート!$U$4=mkrain!B$2,mkrain!B94,IF(事前相談チェックシート!$U$4=mkrain!C$2,mkrain!C94,IF(事前相談チェックシート!$U$4=mkrain!D$2,mkrain!D94,mkrain!E94))),1)","v":6.6}]
[null,9.9430999999999994,7.0810000000000004,9.8939000000000004,6.4127000000000001,92,{"$f":"ROUND(IF(事前相談チェックシート!$U$4=mkrain!B$2,mkrain!B95,IF(事前相談チェックシート!$U$4=mkrain!C$2,mkrain!C95,IF(事前相談チェックシート!$U$4=mkrain!D$2,mkrain!D95,mkrain!E95))),1)","v":6.4}]
[null,9.6059000000000001,6.8457999999999997,9.5588999999999995,6.1970000000000001,93,{"$f":"ROUND(IF(事前相談チェックシート!$U$4=mkrain!B$2,mkrain!B96,IF(事前相談チェックシート!$U$4=mkrain!C$2,mkrain!C96,IF(事前相談チェックシート!$U$4=mkrain!D$2,mkrain!D96,mkrain!E96))),1)","v":6.2}]
[null,9.2954000000000008,6.6289999999999996,9.2504000000000008,5.9983000000000004,94,{"$f":"ROUND(IF(事前相談チェックシート!$U$4=mkrain!B$2,mkrain!B97,IF(事前相談チェックシート!$U$4=mkrain!C$2,mkrain!C97,IF(事前相談チェックシート!$U$4=mkrain!D$2,mkrain!D97,mkrain!E97))),1)","v":6}]
[null,9.0083000000000002,6.4284999999999997,8.9652999999999992,5.8147000000000002,95,{"$f":"ROUND(IF(事前相談チェックシート!$U$4=mkrain!B$2,mkrain!B98,IF(事前相談チェックシート!$U$4=mkrain!C$2,mkrain!C98,IF(事前相談チェックシート!$U$4=mkrain!D$2,mkrain!D98,mkrain!E98))),1)","v":5.8}]
[null,8.7420000000000009,6.2423000000000002,8.7007999999999992,5.6443000000000003,96,{"$f":"ROUND(IF(事前相談チェックシート!$U$4=mkrain!B$2,mkrain!B99,IF(事前相談チェックシート!$U$4=mkrain!C$2,mkrain!C99,IF(事前相談チェックシート!$U$4=mkrain!D$2,mkrain!D99,mkrain!E99))),1)","v":5.6}]
[null,8.4943000000000008,6.0690999999999997,8.4547000000000008,5.4856999999999996,97,{"$f":"ROUND(IF(事前相談チェックシート!$U$4=mkrain!B$2,mkrain!B100,IF(事前相談チェックシート!$U$4=mkrain!C$2,mkrain!C100,IF(事前相談チェックシート!$U$4=mkrain!D$2,mkrain!D100,mkrain!E100))),1)","v":5.5}]
[null,8.2629999999999999,5.9073000000000002,8.2249999999999996,5.3376999999999999,98,{"$f":"ROUND(IF(事前相談チェックシート!$U$4=mkrain!B$2,mkrain!B101,IF(事前相談チェックシート!$U$4=mkrain!C$2,mkrain!C101,IF(事前相談チェックシート!$U$4=mkrain!D$2,mkrain!D101,mkrain!E101))),1)","v":5.3}]
[null,8.0466999999999995,5.7557999999999998,8.01,5.1992000000000003,99,{"$f":"ROUND(IF(事前相談チェックシート!$U$4=mkrain!B$2,mkrain!B102,IF(事前相談チェックシート!$U$4=mkrain!C$2,mkrain!C102,IF(事前相談チェックシート!$U$4=mkrain!D$2,mkrain!D102,mkrain!E102))),1)","v":5.2}]
[null,7.8437000000000001,5.6135999999999999,7.8083999999999998,5.0693000000000001,100,{"$f":"ROUND(IF(事前相談チェックシート!$U$4=mkrain!B$2,mkrain!B103,IF(事前相談チェックシート!$U$4=mkrain!C$2,mkrain!C103,IF(事前相談チェックシート!$U$4=mkrain!D$2,mkrain!D103,mkrain!E103))),1)","v":5.0999999999999996}]
[null,7.6528,5.4798,7.6188000000000002,4.9470999999999998,101,{"$f":"ROUND(IF(事前相談チェックシート!$U$4=mkrain!B$2,mkrain!B104,IF(事前相談チェックシート!$U$4=mkrain!C$2,mkrain!C104,IF(事前相談チェックシート!$U$4=mkrain!D$2,mkrain!D104,mkrain!E104))),1)","v":4.9000000000000004}]
[null,7.4729999999999999,5.3536999999999999,7.4401999999999999,4.8319000000000001,102,{"$f":"ROUND(IF(事前相談チェックシート!$U$4=mkrain!B$2,mkrain!B105,IF(事前相談チェックシート!$U$4=mkrain!C$2,mkrain!C105,IF(事前相談チェックシート!$U$4=mkrain!D$2,mkrain!D105,mkrain!E105))),1)","v":4.8}]
[null,7.3032000000000004,5.2344999999999997,7.2714999999999996,4.7230999999999996,103,{"$f":"ROUND(IF(事前相談チェックシート!$U$4=mkrain!B$2,mkrain!B106,IF(事前相談チェックシート!$U$4=mkrain!C$2,mkrain!C106,IF(事前相談チェックシート!$U$4=mkrain!D$2,mkrain!D106,mkrain!E106))),1)","v":4.7}]
[null,7.1425999999999998,5.1218000000000004,7.1119000000000003,4.6201999999999996,104,{"$f":"ROUND(IF(事前相談チェックシート!$U$4=mkrain!B$2,mkrain!B107,IF(事前相談チェックシート!$U$4=mkrain!C$2,mkrain!C107,IF(事前相談チェックシート!$U$4=mkrain!D$2,mkrain!D107,mkrain!E107))),1)","v":4.5999999999999996}]
[null,6.9904000000000002,5.0148999999999999,6.9607000000000001,4.5227000000000004,105,{"$f":"ROUND(IF(事前相談チェックシート!$U$4=mkrain!B$2,mkrain!B108,IF(事前相談チェックシート!$U$4=mkrain!C$2,mkrain!C108,IF(事前相談チェックシート!$U$4=mkrain!D$2,mkrain!D108,mkrain!E108))),1)","v":4.5}]
[null,6.8460000000000001,4.9132999999999996,6.8171999999999997,4.4301000000000004,106,{"$f":"ROUND(IF(事前相談チェックシート!$U$4=mkrain!B$2,mkrain!B109,IF(事前相談チェックシート!$U$4=mkrain!C$2,mkrain!C109,IF(事前相談チェックシート!$U$4=mkrain!D$2,mkrain!D109,mkrain!E109))),1)","v":4.4000000000000004}]
[null,6.7085999999999997,4.8167999999999997,6.6807999999999996,4.3421000000000003,107,{"$f":"ROUND(IF(事前相談チェックシート!$U$4=mkrain!B$2,mkrain!B110,IF(事前相談チェックシート!$U$4=mkrain!C$2,mkrain!C110,IF(事前相談チェックシート!$U$4=mkrain!D$2,mkrain!D110,mkrain!E110))),1)","v":4.3}]
[null,6.5778999999999996,4.7248000000000001,6.5509000000000004,4.2583000000000002,108,{"$f":"ROUND(IF(事前相談チェックシート!$U$4=mkrain!B$2,mkrain!B111,IF(事前相談チェックシート!$U$4=mkrain!C$2,mkrain!C111,IF(事前相談チェックシート!$U$4=mkrain!D$2,mkrain!D111,mkrain!E111))),1)","v":4.3}]
[null,6.4532999999999996,4.6369999999999996,6.4269999999999996,4.1783000000000001,109,{"$f":"ROUND(IF(事前相談チェックシート!$U$4=mkrain!B$2,mkrain!B112,IF(事前相談チェックシート!$U$4=mkrain!C$2,mkrain!C112,IF(事前相談チェックシート!$U$4=mkrain!D$2,mkrain!D112,mkrain!E112))),1)","v":4.2}]
[null,6.3342999999999998,4.5532000000000004,6.3087999999999997,4.1020000000000003,110,{"$f":"ROUND(IF(事前相談チェックシート!$U$4=mkrain!B$2,mkrain!B113,IF(事前相談チェックシート!$U$4=mkrain!C$2,mkrain!C113,IF(事前相談チェックシート!$U$4=mkrain!D$2,mkrain!D113,mkrain!E113))),1)","v":4.0999999999999996}]
[null,6.2206000000000001,4.4730999999999996,6.1958000000000002,4.0290999999999997,111,{"$f":"ROUND(IF(事前相談チェックシート!$U$4=mkrain!B$2,mkrain!B114,IF(事前相談チェックシート!$U$4=mkrain!C$2,mkrain!C114,IF(事前相談チェックシート!$U$4=mkrain!D$2,mkrain!D114,mkrain!E114))),1)","v":4}]
[null,6.1117999999999997,4.3963999999999999,6.0876999999999999,3.9592000000000001,112,{"$f":"ROUND(IF(事前相談チェックシート!$U$4=mkrain!B$2,mkrain!B115,IF(事前相談チェックシート!$U$4=mkrain!C$2,mkrain!C115,IF(事前相談チェックシート!$U$4=mkrain!D$2,mkrain!D115,mkrain!E115))),1)","v":4}]
[null,6.0075000000000003,4.3228999999999997,5.9840999999999998,3.8923000000000001,113,{"$f":"ROUND(IF(事前相談チェックシート!$U$4=mkrain!B$2,mkrain!B116,IF(事前相談チェックシート!$U$4=mkrain!C$2,mkrain!C116,IF(事前相談チェックシート!$U$4=mkrain!D$2,mkrain!D116,mkrain!E116))),1)","v":3.9}]
[null,5.9076000000000004,4.2523999999999997,5.8848000000000003,3.8281999999999998,114,{"$f":"ROUND(IF(事前相談チェックシート!$U$4=mkrain!B$2,mkrain!B117,IF(事前相談チェックシート!$U$4=mkrain!C$2,mkrain!C117,IF(事前相談チェックシート!$U$4=mkrain!D$2,mkrain!D117,mkrain!E117))),1)","v":3.8}]
[null,5.8116000000000003,4.1845999999999997,5.7893999999999997,3.7665999999999999,115,{"$f":"ROUND(IF(事前相談チェックシート!$U$4=mkrain!B$2,mkrain!B118,IF(事前相談チェックシート!$U$4=mkrain!C$2,mkrain!C118,IF(事前相談チェックシート!$U$4=mkrain!D$2,mkrain!D118,mkrain!E118))),1)","v":3.8}]
[null,5.7194000000000003,4.1195000000000004,5.6978,3.7073999999999998,116,{"$f":"ROUND(IF(事前相談チェックシート!$U$4=mkrain!B$2,mkrain!B119,IF(事前相談チェックシート!$U$4=mkrain!C$2,mkrain!C119,IF(事前相談チェックシート!$U$4=mkrain!D$2,mkrain!D119,mkrain!E119))),1)","v":3.7}]
[null,5.6307999999999998,4.0568999999999997,5.6096000000000004,3.6503999999999999,117,{"$f":"ROUND(IF(事前相談チェックシート!$U$4=mkrain!B$2,mkrain!B120,IF(事前相談チェックシート!$U$4=mkrain!C$2,mkrain!C120,IF(事前相談チェックシート!$U$4=mkrain!D$2,mkrain!D120,mkrain!E120))),1)","v":3.7}]
[null,5.5453999999999999,3.9965999999999999,5.5247999999999999,3.5956000000000001,118,{"$f":"ROUND(IF(事前相談チェックシート!$U$4=mkrain!B$2,mkrain!B121,IF(事前相談チェックシート!$U$4=mkrain!C$2,mkrain!C121,IF(事前相談チェックシート!$U$4=mkrain!D$2,mkrain!D121,mkrain!E121))),1)","v":3.6}]
[null,5.4631999999999996,3.9384000000000001,5.4431000000000003,3.5428000000000002,119,{"$f":"ROUND(IF(事前相談チェックシート!$U$4=mkrain!B$2,mkrain!B122,IF(事前相談チェックシート!$U$4=mkrain!C$2,mkrain!C122,IF(事前相談チェックシート!$U$4=mkrain!D$2,mkrain!D122,mkrain!E122))),1)","v":3.5}]
[null,5.3838999999999997,3.8822999999999999,5.3642000000000003,3.4918,120,{"$f":"ROUND(IF(事前相談チェックシート!$U$4=mkrain!B$2,mkrain!B123,IF(事前相談チェックシート!$U$4=mkrain!C$2,mkrain!C123,IF(事前相談チェックシート!$U$4=mkrain!D$2,mkrain!D123,mkrain!E123))),1)","v":3.5}]
[null,5.3074000000000003,3.8281999999999998,5.2881999999999998,3.4426000000000001,121,{"$f":"ROUND(IF(事前相談チェックシート!$U$4=mkrain!B$2,mkrain!B124,IF(事前相談チェックシート!$U$4=mkrain!C$2,mkrain!C124,IF(事前相談チェックシート!$U$4=mkrain!D$2,mkrain!D124,mkrain!E124))),1)","v":3.4}]
[null,5.2335000000000003,3.7759,5.2148000000000003,3.3952,122,{"$f":"ROUND(IF(事前相談チェックシート!$U$4=mkrain!B$2,mkrain!B125,IF(事前相談チェックシート!$U$4=mkrain!C$2,mkrain!C125,IF(事前相談チェックシート!$U$4=mkrain!D$2,mkrain!D125,mkrain!E125))),1)","v":3.4}]
[null,5.1620999999999997,3.7254,5.1437999999999997,3.3492999999999999,123,{"$f":"ROUND(IF(事前相談チェックシート!$U$4=mkrain!B$2,mkrain!B126,IF(事前相談チェックシート!$U$4=mkrain!C$2,mkrain!C126,IF(事前相談チェックシート!$U$4=mkrain!D$2,mkrain!D126,mkrain!E126))),1)","v":3.3}]
[null,5.0930999999999997,3.6764999999999999,5.0751999999999997,3.3048999999999999,124,{"$f":"ROUND(IF(事前相談チェックシート!$U$4=mkrain!B$2,mkrain!B127,IF(事前相談チェックシート!$U$4=mkrain!C$2,mkrain!C127,IF(事前相談チェックシート!$U$4=mkrain!D$2,mkrain!D127,mkrain!E127))),1)","v":3.3}]
[null,5.0263,3.6291000000000002,5.0087999999999999,3.2618999999999998,125,{"$f":"ROUND(IF(事前相談チェックシート!$U$4=mkrain!B$2,mkrain!B128,IF(事前相談チェックシート!$U$4=mkrain!C$2,mkrain!C128,IF(事前相談チェックシート!$U$4=mkrain!D$2,mkrain!D128,mkrain!E128))),1)","v":3.3}]
[null,4.9617000000000004,3.5832999999999999,4.9444999999999997,3.2202999999999999,126,{"$f":"ROUND(IF(事前相談チェックシート!$U$4=mkrain!B$2,mkrain!B129,IF(事前相談チェックシート!$U$4=mkrain!C$2,mkrain!C129,IF(事前相談チェックシート!$U$4=mkrain!D$2,mkrain!D129,mkrain!E129))),1)","v":3.2}]
[null,4.899,3.5388999999999999,4.8822000000000001,3.18,127,{"$f":"ROUND(IF(事前相談チェックシート!$U$4=mkrain!B$2,mkrain!B130,IF(事前相談チェックシート!$U$4=mkrain!C$2,mkrain!C130,IF(事前相談チェックシート!$U$4=mkrain!D$2,mkrain!D130,mkrain!E130))),1)","v":3.2}]
[null,4.8383000000000003,3.4958,4.8217999999999996,3.141,128,{"$f":"ROUND(IF(事前相談チェックシート!$U$4=mkrain!B$2,mkrain!B131,IF(事前相談チェックシート!$U$4=mkrain!C$2,mkrain!C131,IF(事前相談チェックシート!$U$4=mkrain!D$2,mkrain!D131,mkrain!E131))),1)","v":3.1}]
[null,4.7793999999999999,3.4540000000000002,4.7632000000000003,3.1031,129,{"$f":"ROUND(IF(事前相談チェックシート!$U$4=mkrain!B$2,mkrain!B132,IF(事前相談チェックシート!$U$4=mkrain!C$2,mkrain!C132,IF(事前相談チェックシート!$U$4=mkrain!D$2,mkrain!D132,mkrain!E132))),1)","v":3.1}]
[null,4.7222,3.4134000000000002,4.7064000000000004,3.0663,130,{"$f":"ROUND(IF(事前相談チェックシート!$U$4=mkrain!B$2,mkrain!B133,IF(事前相談チェックシート!$U$4=mkrain!C$2,mkrain!C133,IF(事前相談チェックシート!$U$4=mkrain!D$2,mkrain!D133,mkrain!E133))),1)","v":3.1}]
[null,4.6666999999999996,3.3740000000000001,4.6512000000000002,3.0306000000000002,131,{"$f":"ROUND(IF(事前相談チェックシート!$U$4=mkrain!B$2,mkrain!B134,IF(事前相談チェックシート!$U$4=mkrain!C$2,mkrain!C134,IF(事前相談チェックシート!$U$4=mkrain!D$2,mkrain!D134,mkrain!E134))),1)","v":3}]
[null,4.6128,3.3357000000000001,4.5975999999999999,2.9958,132,{"$f":"ROUND(IF(事前相談チェックシート!$U$4=mkrain!B$2,mkrain!B135,IF(事前相談チェックシート!$U$4=mkrain!C$2,mkrain!C135,IF(事前相談チェックシート!$U$4=mkrain!D$2,mkrain!D135,mkrain!E135))),1)","v":3}]
[null,4.5603999999999996,3.2985000000000002,4.5454999999999997,2.9621,133,{"$f":"ROUND(IF(事前相談チェックシート!$U$4=mkrain!B$2,mkrain!B136,IF(事前相談チェックシート!$U$4=mkrain!C$2,mkrain!C136,IF(事前相談チェックシート!$U$4=mkrain!D$2,mkrain!D136,mkrain!E136))),1)","v":3}]
[null,4.5095000000000001,3.2623000000000002,4.4947999999999997,2.9293,134,{"$f":"ROUND(IF(事前相談チェックシート!$U$4=mkrain!B$2,mkrain!B137,IF(事前相談チェックシート!$U$4=mkrain!C$2,mkrain!C137,IF(事前相談チェックシート!$U$4=mkrain!D$2,mkrain!D137,mkrain!E137))),1)","v":2.9}]
[null,4.4599000000000002,3.2271000000000001,4.4455,2.8974000000000002,135,{"$f":"ROUND(IF(事前相談チェックシート!$U$4=mkrain!B$2,mkrain!B138,IF(事前相談チェックシート!$U$4=mkrain!C$2,mkrain!C138,IF(事前相談チェックシート!$U$4=mkrain!D$2,mkrain!D138,mkrain!E138))),1)","v":2.9}]
[null,4.4116999999999997,3.1928000000000001,4.3975999999999997,2.8662999999999998,136,{"$f":"ROUND(IF(事前相談チェックシート!$U$4=mkrain!B$2,mkrain!B139,IF(事前相談チェックシート!$U$4=mkrain!C$2,mkrain!C139,IF(事前相談チェックシート!$U$4=mkrain!D$2,mkrain!D139,mkrain!E139))),1)","v":2.9}]
[null,4.3647,3.1594000000000002,4.3507999999999996,2.8361000000000001,137,{"$f":"ROUND(IF(事前相談チェックシート!$U$4=mkrain!B$2,mkrain!B140,IF(事前相談チェックシート!$U$4=mkrain!C$2,mkrain!C140,IF(事前相談チェックシート!$U$4=mkrain!D$2,mkrain!D140,mkrain!E140))),1)","v":2.8}]
[null,4.319,3.1267999999999998,4.3052999999999999,2.8066,138,{"$f":"ROUND(IF(事前相談チェックシート!$U$4=mkrain!B$2,mkrain!B141,IF(事前相談チェックシート!$U$4=mkrain!C$2,mkrain!C141,IF(事前相談チェックシート!$U$4=mkrain!D$2,mkrain!D141,mkrain!E141))),1)","v":2.8}]
[null,4.2744,3.0951,4.2610000000000001,2.7778999999999998,139,{"$f":"ROUND(IF(事前相談チェックシート!$U$4=mkrain!B$2,mkrain!B142,IF(事前相談チェックシート!$U$4=mkrain!C$2,mkrain!C142,IF(事前相談チェックシート!$U$4=mkrain!D$2,mkrain!D142,mkrain!E142))),1)","v":2.8}]
[null,4.2309000000000001,3.0642,4.2178000000000004,2.7498999999999998,140,{"$f":"ROUND(IF(事前相談チェックシート!$U$4=mkrain!B$2,mkrain!B143,IF(事前相談チェックシート!$U$4=mkrain!C$2,mkrain!C143,IF(事前相談チェックシート!$U$4=mkrain!D$2,mkrain!D143,mkrain!E143))),1)","v":2.7}]
[null,4.1885000000000003,3.0339999999999998,4.1756000000000002,2.7225000000000001,141,{"$f":"ROUND(IF(事前相談チェックシート!$U$4=mkrain!B$2,mkrain!B144,IF(事前相談チェックシート!$U$4=mkrain!C$2,mkrain!C144,IF(事前相談チェックシート!$U$4=mkrain!D$2,mkrain!D144,mkrain!E144))),1)","v":2.7}]
[null,4.1471999999999998,3.0045000000000002,4.1345000000000001,2.6959,142,{"$f":"ROUND(IF(事前相談チェックシート!$U$4=mkrain!B$2,mkrain!B145,IF(事前相談チェックシート!$U$4=mkrain!C$2,mkrain!C145,IF(事前相談チェックシート!$U$4=mkrain!D$2,mkrain!D145,mkrain!E145))),1)","v":2.7}]
[null,4.1069000000000004,2.9758,4.0944000000000003,2.6699000000000002,143,{"$f":"ROUND(IF(事前相談チェックシート!$U$4=mkrain!B$2,mkrain!B146,IF(事前相談チェックシート!$U$4=mkrain!C$2,mkrain!C146,IF(事前相談チェックシート!$U$4=mkrain!D$2,mkrain!D146,mkrain!E146))),1)","v":2.7}]
[null,4.0674999999999999,2.9477000000000002,4.0552000000000001,2.6444999999999999,144,{"$f":"ROUND(IF(事前相談チェックシート!$U$4=mkrain!B$2,mkrain!B147,IF(事前相談チェックシート!$U$4=mkrain!C$2,mkrain!C147,IF(事前相談チェックシート!$U$4=mkrain!D$2,mkrain!D147,mkrain!E147))),1)","v":2.6}]

{"sheet":"runoff","index":15,"n_rows":148,"n_cols":3,"rows_kept":148,"cut":false,"hidden":true,"merged":[]}
[null,{"$f":"MAX(B4:B148)","v":{"$error":"#DIV/0!"}},{"$f":"MAX(C4:C148)","v":{"$error":"#DIV/0!"}}]
[null,"行為前","行為後"]
[null,"流出量","流出量"]
["00:00:00",0,0]
["00:10:00",{"$f":"ROUND(1/360*事前相談チェックシート!$R$10*mkrain!$G4*事前相談チェックシート!$L$28,5)","v":{"$error":"#DIV/0!"}},{"$f":"ROUND(1/360*事前相談チェックシート!$R$12*mkrain!$G4*事前相談チェックシート!$M$28,5)","v":{"$error":"#DIV/0!"}}]
["00:20:00",{"$f":"ROUND(1/360*事前相談チェックシート!$R$10*mkrain!$G5*事前相談チェックシート!$L$28,5)","v":{"$error":"#DIV/0!"}},{"$f":"ROUND(1/360*事前相談チェックシート!$R$12*mkrain!$G5*事前相談チェックシート!$M$28,5)","v":{"$error":"#DIV/0!"}}]
["00:30:00",{"$f":"ROUND(1/360*事前相談チェックシート!$R$10*mkrain!$G6*事前相談チェックシート!$L$28,5)","v":{"$error":"#DIV/0!"}},{"$f":"ROUND(1/360*事前相談チェックシート!$R$12*mkrain!$G6*事前相談チェックシート!$M$28,5)","v":{"$error":"#DIV/0!"}}]
["00:40:00",{"$f":"ROUND(1/360*事前相談チェックシート!$R$10*mkrain!$G7*事前相談チェックシート!$L$28,5)","v":{"$error":"#DIV/0!"}},{"$f":"ROUND(1/360*事前相談チェックシート!$R$12*mkrain!$G7*事前相談チェックシート!$M$28,5)","v":{"$error":"#DIV/0!"}}]
["00:50:00",{"$f":"ROUND(1/360*事前相談チェックシート!$R$10*mkrain!$G8*事前相談チェックシート!$L$28,5)","v":{"$error":"#DIV/0!"}},{"$f":"ROUND(1/360*事前相談チェックシート!$R$12*mkrain!$G8*事前相談チェックシート!$M$28,5)","v":{"$error":"#DIV/0!"}}]
["01:00:00",{"$f":"ROUND(1/360*事前相談チェックシート!$R$10*mkrain!$G9*事前相談チェックシート!$L$28,5)","v":{"$error":"#DIV/0!"}},{"$f":"ROUND(1/360*事前相談チェックシート!$R$12*mkrain!$G9*事前相談チェックシート!$M$28,5)","v":{"$error":"#DIV/0!"}}]
["01:10:00",{"$f":"ROUND(1/360*事前相談チェックシート!$R$10*mkrain!$G10*事前相談チェックシート!$L$28,5)","v":{"$error":"#DIV/0!"}},{"$f":"ROUND(1/360*事前相談チェックシート!$R$12*mkrain!$G10*事前相談チェックシート!$M$28,5)","v":{"$error":"#DIV/0!"}}]
["01:20:00",{"$f":"ROUND(1/360*事前相談チェックシート!$R$10*mkrain!$G11*事前相談チェックシート!$L$28,5)","v":{"$error":"#DIV/0!"}},{"$f":"ROUND(1/360*事前相談チェックシート!$R$12*mkrain!$G11*事前相談チェックシート!$M$28,5)","v":{"$error":"#DIV/0!"}}]
["01:30:00",{"$f":"ROUND(1/360*事前相談チェックシート!$R$10*mkrain!$G12*事前相談チェックシート!$L$28,5)","v":{"$error":"#DIV/0!"}},{"$f":"ROUND(1/360*事前相談チェックシート!$R$12*mkrain!$G12*事前相談チェックシート!$M$28,5)","v":{"$error":"#DIV/0!"}}]
["01:40:00",{"$f":"ROUND(1/360*事前相談チェックシート!$R$10*mkrain!$G13*事前相談チェックシート!$L$28,5)","v":{"$error":"#DIV/0!"}},{"$f":"ROUND(1/360*事前相談チェックシート!$R$12*mkrain!$G13*事前相談チェックシート!$M$28,5)","v":{"$error":"#DIV/0!"}}]
["01:50:00",{"$f":"ROUND(1/360*事前相談チェックシート!$R$10*mkrain!$G14*事前相談チェックシート!$L$28,5)","v":{"$error":"#DIV/0!"}},{"$f":"ROUND(1/360*事前相談チェックシート!$R$12*mkrain!$G14*事前相談チェックシート!$M$28,5)","v":{"$error":"#DIV/0!"}}]
["02:00:00",{"$f":"ROUND(1/360*事前相談チェックシート!$R$10*mkrain!$G15*事前相談チェックシート!$L$28,5)","v":{"$error":"#DIV/0!"}},{"$f":"ROUND(1/360*事前相談チェックシート!$R$12*mkrain!$G15*事前相談チェックシート!$M$28,5)","v":{"$error":"#DIV/0!"}}]
["02:10:00",{"$f":"ROUND(1/360*事前相談チェックシート!$R$10*mkrain!$G16*事前相談チェックシート!$L$28,5)","v":{"$error":"#DIV/0!"}},{"$f":"ROUND(1/360*事前相談チェックシート!$R$12*mkrain!$G16*事前相談チェックシート!$M$28,5)","v":{"$error":"#DIV/0!"}}]
["02:20:00",{"$f":"ROUND(1/360*事前相談チェックシート!$R$10*mkrain!$G17*事前相談チェックシート!$L$28,5)","v":{"$error":"#DIV/0!"}},{"$f":"ROUND(1/360*事前相談チェックシート!$R$12*mkrain!$G17*事前相談チェックシート!$M$28,5)","v":{"$error":"#DIV/0!"}}]
["02:30:00",{"$f":"ROUND(1/360*事前相談チェックシート!$R$10*mkrain!$G18*事前相談チェックシート!$L$28,5)","v":{"$error":"#DIV/0!"}},{"$f":"ROUND(1/360*事前相談チェックシート!$R$12*mkrain!$G18*事前相談チェックシート!$M$28,5)","v":{"$error":"#DIV/0!"}}]
["02:40:00",{"$f":"ROUND(1/360*事前相談チェックシート!$R$10*mkrain!$G19*事前相談チェックシート!$L$28,5)","v":{"$error":"#DIV/0!"}},{"$f":"ROUND(1/360*事前相談チェックシート!$R$12*mkrain!$G19*事前相談チェックシート!$M$28,5)","v":{"$error":"#DIV/0!"}}]
["02:50:00",{"$f":"ROUND(1/360*事前相談チェックシート!$R$10*mkrain!$G20*事前相談チェックシート!$L$28,5)","v":{"$error":"#DIV/0!"}},{"$f":"ROUND(1/360*事前相談チェックシート!$R$12*mkrain!$G20*事前相談チェックシート!$M$28,5)","v":{"$error":"#DIV/0!"}}]
["03:00:00",{"$f":"ROUND(1/360*事前相談チェックシート!$R$10*mkrain!$G21*事前相談チェックシート!$L$28,5)","v":{"$error":"#DIV/0!"}},{"$f":"ROUND(1/360*事前相談チェックシート!$R$12*mkrain!$G21*事前相談チェックシート!$M$28,5)","v":{"$error":"#DIV/0!"}}]
["03:10:00",{"$f":"ROUND(1/360*事前相談チェックシート!$R$10*mkrain!$G22*事前相談チェックシート!$L$28,5)","v":{"$error":"#DIV/0!"}},{"$f":"ROUND(1/360*事前相談チェックシート!$R$12*mkrain!$G22*事前相談チェックシート!$M$28,5)","v":{"$error":"#DIV/0!"}}]
["03:20:00",{"$f":"ROUND(1/360*事前相談チェックシート!$R$10*mkrain!$G23*事前相談チェックシート!$L$28,5)","v":{"$error":"#DIV/0!"}},{"$f":"ROUND(1/360*事前相談チェックシート!$R$12*mkrain!$G23*事前相談チェックシート!$M$28,5)","v":{"$error":"#DIV/0!"}}]
["03:30:00",{"$f":"ROUND(1/360*事前相談チェックシート!$R$10*mkrain!$G24*事前相談チェックシート!$L$28,5)","v":{"$error":"#DIV/0!"}},{"$f":"ROUND(1/360*事前相談チェックシート!$R$12*mkrain!$G24*事前相談チェックシート!$M$28,5)","v":{"$error":"#DIV/0!"}}]
["03:40:00",{"$f":"ROUND(1/360*事前相談チェックシート!$R$10*mkrain!$G25*事前相談チェックシート!$L$28,5)","v":{"$error":"#DIV/0!"}},{"$f":"ROUND(1/360*事前相談チェックシート!$R$12*mkrain!$G25*事前相談チェックシート!$M$28,5)","v":{"$error":"#DIV/0!"}}]
["03:50:00",{"$f":"ROUND(1/360*事前相談チェックシート!$R$10*mkrain!$G26*事前相談チェックシート!$L$28,5)","v":{"$error":"#DIV/0!"}},{"$f":"ROUND(1/360*事前相談チェックシート!$R$12*mkrain!$G26*事前相談チェックシート!$M$28,5)","v":{"$error":"#DIV/0!"}}]
["04:00:00",{"$f":"ROUND(1/360*事前相談チェックシート!$R$10*mkrain!$G27*事前相談チェックシート!$L$28,5)","v":{"$error":"#DIV/0!"}},{"$f":"ROUND(1/360*事前相談チェックシート!$R$12*mkrain!$G27*事前相談チェックシート!$M$28,5)","v":{"$error":"#DIV/0!"}}]
["04:10:00",{"$f":"ROUND(1/360*事前相談チェックシート!$R$10*mkrain!$G28*事前相談チェックシート!$L$28,5)","v":{"$error":"#DIV/0!"}},{"$f":"ROUND(1/360*事前相談チェックシート!$R$12*mkrain!$G28*事前相談チェックシート!$M$28,5)","v":{"$error":"#DIV/0!"}}]
["04:20:00",{"$f":"ROUND(1/360*事前相談チェックシート!$R$10*mkrain!$G29*事前相談チェックシート!$L$28,5)","v":{"$error":"#DIV/0!"}},{"$f":"ROUND(1/360*事前相談チェックシート!$R$12*mkrain!$G29*事前相談チェックシート!$M$28,5)","v":{"$error":"#DIV/0!"}}]
["04:30:00",{"$f":"ROUND(1/360*事前相談チェックシート!$R$10*mkrain!$G30*事前相談チェックシート!$L$28,5)","v":{"$error":"#DIV/0!"}},{"$f":"ROUND(1/360*事前相談チェックシート!$R$12*mkrain!$G30*事前相談チェックシート!$M$28,5)","v":{"$error":"#DIV/0!"}}]
["04:40:00",{"$f":"ROUND(1/360*事前相談チェックシート!$R$10*mkrain!$G31*事前相談チェックシート!$L$28,5)","v":{"$error":"#DIV/0!"}},{"$f":"ROUND(1/360*事前相談チェックシート!$R$12*mkrain!$G31*事前相談チェックシート!$M$28,5)","v":{"$error":"#DIV/0!"}}]
["04:50:00",{"$f":"ROUND(1/360*事前相談チェックシート!$R$10*mkrain!$G32*事前相談チェックシート!$L$28,5)","v":{"$error":"#DIV/0!"}},{"$f":"ROUND(1/360*事前相談チェックシート!$R$12*mkrain!$G32*事前相談チェックシート!$M$28,5)","v":{"$error":"#DIV/0!"}}]
["05:00:00",{"$f":"ROUND(1/360*事前相談チェックシート!$R$10*mkrain!$G33*事前相談チェックシート!$L$28,5)","v":{"$error":"#DIV/0!"}},{"$f":"ROUND(1/360*事前相談チェックシート!$R$12*mkrain!$G33*事前相談チェックシート!$M$28,5)","v":{"$error":"#DIV/0!"}}]
["05:10:00",{"$f":"ROUND(1/360*事前相談チェックシート!$R$10*mkrain!$G34*事前相談チェックシート!$L$28,5)","v":{"$error":"#DIV/0!"}},{"$f":"ROUND(1/360*事前相談チェックシート!$R$12*mkrain!$G34*事前相談チェックシート!$M$28,5)","v":{"$error":"#DIV/0!"}}]
["05:20:00",{"$f":"ROUND(1/360*事前相談チェックシート!$R$10*mkrain!$G35*事前相談チェックシート!$L$28,5)","v":{"$error":"#DIV/0!"}},{"$f":"ROUND(1/360*事前相談チェックシート!$R$12*mkrain!$G35*事前相談チェックシート!$M$28,5)","v":{"$error":"#DIV/0!"}}]
["05:30:00",{"$f":"ROUND(1/360*事前相談チェックシート!$R$10*mkrain!$G36*事前相談チェックシート!$L$28,5)","v":{"$error":"#DIV/0!"}},{"$f":"ROUND(1/360*事前相談チェックシート!$R$12*mkrain!$G36*事前相談チェックシート!$M$28,5)","v":{"$error":"#DIV/0!"}}]
["05:40:00",{"$f":"ROUND(1/360*事前相談チェックシート!$R$10*mkrain!$G37*事前相談チェックシート!$L$28,5)","v":{"$error":"#DIV/0!"}},{"$f":"ROUND(1/360*事前相談チェックシート!$R$12*mkrain!$G37*事前相談チェックシート!$M$28,5)","v":{"$error":"#DIV/0!"}}]
["05:50:00",{"$f":"ROUND(1/360*事前相談チェックシート!$R$10*mkrain!$G38*事前相談チェックシート!$L$28,5)","v":{"$error":"#DIV/0!"}},{"$f":"ROUND(1/360*事前相談チェックシート!$R$12*mkrain!$G38*事前相談チェックシート!$M$28,5)","v":{"$error":"#DIV/0!"}}]
["06:00:00",{"$f":"ROUND(1/360*事前相談チェックシート!$R$10*mkrain!$G39*事前相談チェックシート!$L$28,5)","v":{"$error":"#DIV/0!"}},{"$f":"ROUND(1/360*事前相談チェックシート!$R$12*mkrain!$G39*事前相談チェックシート!$M$28,5)","v":{"$error":"#DIV/0!"}}]
["06:10:00",{"$f":"ROUND(1/360*事前相談チェックシート!$R$10*mkrain!$G40*事前相談チェックシート!$L$28,5)","v":{"$error":"#DIV/0!"}},{"$f":"ROUND(1/360*事前相談チェックシート!$R$12*mkrain!$G40*事前相談チェックシート!$M$28,5)","v":{"$error":"#DIV/0!"}}]
["06:20:00",{"$f":"ROUND(1/360*事前相談チェックシート!$R$10*mkrain!$G41*事前相談チェックシート!$L$28,5)","v":{"$error":"#DIV/0!"}},{"$f":"ROUND(1/360*事前相談チェックシート!$R$12*mkrain!$G41*事前相談チェックシート!$M$28,5)","v":{"$error":"#DIV/0!"}}]
["06:30:00",{"$f":"ROUND(1/360*事前相談チェックシート!$R$10*mkrain!$G42*事前相談チェックシート!$L$28,5)","v":{"$error":"#DIV/0!"}},{"$f":"ROUND(1/360*事前相談チェックシート!$R$12*mkrain!$G42*事前相談チェックシート!$M$28,5)","v":{"$error":"#DIV/0!"}}]
["06:40:00",{"$f":"ROUND(1/360*事前相談チェックシート!$R$10*mkrain!$G43*事前相談チェックシート!$L$28,5)","v":{"$error":"#DIV/0!"}},{"$f":"ROUND(1/360*事前相談チェックシート!$R$12*mkrain!$G43*事前相談チェックシート!$M$28,5)","v":{"$error":"#DIV/0!"}}]
["06:50:00",{"$f":"ROUND(1/360*事前相談チェックシート!$R$10*mkrain!$G44*事前相談チェックシート!$L$28,5)","v":{"$error":"#DIV/0!"}},{"$f":"ROUND(1/360*事前相談チェックシート!$R$12*mkrain!$G44*事前相談チェックシート!$M$28,5)","v":{"$error":"#DIV/0!"}}]
["07:00:00",{"$f":"ROUND(1/360*事前相談チェックシート!$R$10*mkrain!$G45*事前相談チェックシート!$L$28,5)","v":{"$error":"#DIV/0!"}},{"$f":"ROUND(1/360*事前相談チェックシート!$R$12*mkrain!$G45*事前相談チェックシート!$M$28,5)","v":{"$error":"#DIV/0!"}}]
["07:10:00",{"$f":"ROUND(1/360*事前相談チェックシート!$R$10*mkrain!$G46*事前相談チェックシート!$L$28,5)","v":{"$error":"#DIV/0!"}},{"$f":"ROUND(1/360*事前相談チェックシート!$R$12*mkrain!$G46*事前相談チェックシート!$M$28,5)","v":{"$error":"#DIV/0!"}}]
["07:20:00",{"$f":"ROUND(1/360*事前相談チェックシート!$R$10*mkrain!$G47*事前相談チェックシート!$L$28,5)","v":{"$error":"#DIV/0!"}},{"$f":"ROUND(1/360*事前相談チェックシート!$R$12*mkrain!$G47*事前相談チェックシート!$M$28,5)","v":{"$error":"#DIV/0!"}}]
["07:30:00",{"$f":"ROUND(1/360*事前相談チェックシート!$R$10*mkrain!$G48*事前相談チェックシート!$L$28,5)","v":{"$error":"#DIV/0!"}},{"$f":"ROUND(1/360*事前相談チェックシート!$R$12*mkrain!$G48*事前相談チェックシート!$M$28,5)","v":{"$error":"#DIV/0!"}}]
["07:40:00",{"$f":"ROUND(1/360*事前相談チェックシート!$R$10*mkrain!$G49*事前相談チェックシート!$L$28,5)","v":{"$error":"#DIV/0!"}},{"$f":"ROUND(1/360*事前相談チェックシート!$R$12*mkrain!$G49*事前相談チェックシート!$M$28,5)","v":{"$error":"#DIV/0!"}}]
["07:50:00",{"$f":"ROUND(1/360*事前相談チェックシート!$R$10*mkrain!$G50*事前相談チェックシート!$L$28,5)","v":{"$error":"#DIV/0!"}},{"$f":"ROUND(1/360*事前相談チェックシート!$R$12*mkrain!$G50*事前相談チェックシート!$M$28,5)","v":{"$error":"#DIV/0!"}}]
["08:00:00",{"$f":"ROUND(1/360*事前相談チェックシート!$R$10*mkrain!$G51*事前相談チェックシート!$L$28,5)","v":{"$error":"#DIV/0!"}},{"$f":"ROUND(1/360*事前相談チェックシート!$R$12*mkrain!$G51*事前相談チェックシート!$M$28,5)","v":{"$error":"#DIV/0!"}}]
["08:10:00",{"$f":"ROUND(1/360*事前相談チェックシート!$R$10*mkrain!$G52*事前相談チェックシート!$L$28,5)","v":{"$error":"#DIV/0!"}},{"$f":"ROUND(1/360*事前相談チェックシート!$R$12*mkrain!$G52*事前相談チェックシート!$M$28,5)","v":{"$error":"#DIV/0!"}}]
["08:20:00",{"$f":"ROUND(1/360*事前相談チェックシート!$R$10*mkrain!$G53*事前相談チェックシート!$L$28,5)","v":{"$error":"#DIV/0!"}},{"$f":"ROUND(1/360*事前相談チェックシート!$R$12*mkrain!$G53*事前相談チェックシート!$M$28,5)","v":{"$error":"#DIV/0!"}}]
["08:30:00",{"$f":"ROUND(1/360*事前相談チェックシート!$R$10*mkrain!$G54*事前相談チェックシート!$L$28,5)","v":{"$error":"#DIV/0!"}},{"$f":"ROUND(1/360*事前相談チェックシート!$R$12*mkrain!$G54*事前相談チェックシート!$M$28,5)","v":{"$error":"#DIV/0!"}}]
["08:40:00",{"$f":"ROUND(1/360*事前相談チェックシート!$R$10*mkrain!$G55*事前相談チェックシート!$L$28,5)","v":{"$error":"#DIV/0!"}},{"$f":"ROUND(1/360*事前相談チェックシート!$R$12*mkrain!$G55*事前相談チェックシート!$M$28,5)","v":{"$error":"#DIV/0!"}}]
["08:50:00",{"$f":"ROUND(1/360*事前相談チェックシート!$R$10*mkrain!$G56*事前相談チェックシート!$L$28,5)","v":{"$error":"#DIV/0!"}},{"$f":"ROUND(1/360*事前相談チェックシート!$R$12*mkrain!$G56*事前相談チェックシート!$M$28,5)","v":{"$error":"#DIV/0!"}}]
["09:00:00",{"$f":"ROUND(1/360*事前相談チェックシート!$R$10*mkrain!$G57*事前相談チェックシート!$L$28,5)","v":{"$error":"#DIV/0!"}},{"$f":"ROUND(1/360*事前相談チェックシート!$R$12*mkrain!$G57*事前相談チェックシート!$M$28,5)","v":{"$error":"#DIV/0!"}}]
["09:10:00",{"$f":"ROUND(1/360*事前相談チェックシート!$R$10*mkrain!$G58*事前相談チェックシート!$L$28,5)","v":{"$error":"#DIV/0!"}},{"$f":"ROUND(1/360*事前相談チェックシート!$R$12*mkrain!$G58*事前相談チェックシート!$M$28,5)","v":{"$error":"#DIV/0!"}}]
["09:20:00",{"$f":"ROUND(1/360*事前相談チェックシート!$R$10*mkrain!$G59*事前相談チェックシート!$L$28,5)","v":{"$error":"#DIV/0!"}},{"$f":"ROUND(1/360*事前相談チェックシート!$R$12*mkrain!$G59*事前相談チェックシート!$M$28,5)","v":{"$error":"#DIV/0!"}}]
["09:30:00",{"$f":"ROUND(1/360*事前相談チェックシート!$R$10*mkrain!$G60*事前相談チェックシート!$L$28,5)","v":{"$error":"#DIV/0!"}},{"$f":"ROUND(1/360*事前相談チェックシート!$R$12*mkrain!$G60*事前相談チェックシート!$M$28,5)","v":{"$error":"#DIV/0!"}}]
["09:40:00",{"$f":"ROUND(1/360*事前相談チェックシート!$R$10*mkrain!$G61*事前相談チェックシート!$L$28,5)","v":{"$error":"#DIV/0!"}},{"$f":"ROUND(1/360*事前相談チェックシート!$R$12*mkrain!$G61*事前相談チェックシート!$M$28,5)","v":{"$error":"#DIV/0!"}}]
["09:50:00",{"$f":"ROUND(1/360*事前相談チェックシート!$R$10*mkrain!$G62*事前相談チェックシート!$L$28,5)","v":{"$error":"#DIV/0!"}},{"$f":"ROUND(1/360*事前相談チェックシート!$R$12*mkrain!$G62*事前相談チェックシート!$M$28,5)","v":{"$error":"#DIV/0!"}}]
["10:00:00",{"$f":"ROUND(1/360*事前相談チェックシート!$R$10*mkrain!$G63*事前相談チェックシート!$L$28,5)","v":{"$error":"#DIV/0!"}},{"$f":"ROUND(1/360*事前相談チェックシート!$R$12*mkrain!$G63*事前相談チェックシート!$M$28,5)","v":{"$error":"#DIV/0!"}}]
["10:10:00",{"$f":"ROUND(1/360*事前相談チェックシート!$R$10*mkrain!$G64*事前相談チェックシート!$L$28,5)","v":{"$error":"#DIV/0!"}},{"$f":"ROUND(1/360*事前相談チェックシート!$R$12*mkrain!$G64*事前相談チェックシート!$M$28,5)","v":{"$error":"#DIV/0!"}}]
["10:20:00",{"$f":"ROUND(1/360*事前相談チェックシート!$R$10*mkrain!$G65*事前相談チェックシート!$L$28,5)","v":{"$error":"#DIV/0!"}},{"$f":"ROUND(1/360*事前相談チェックシート!$R$12*mkrain!$G65*事前相談チェックシート!$M$28,5)","v":{"$error":"#DIV/0!"}}]
["10:30:00",{"$f":"ROUND(1/360*事前相談チェックシート!$R$10*mkrain!$G66*事前相談チェックシート!$L$28,5)","v":{"$error":"#DIV/0!"}},{"$f":"ROUND(1/360*事前相談チェックシート!$R$12*mkrain!$G66*事前相談チェックシート!$M$28,5)","v":{"$error":"#DIV/0!"}}]
["10:40:00",{"$f":"ROUND(1/360*事前相談チェックシート!$R$10*mkrain!$G67*事前相談チェックシート!$L$28,5)","v":{"$error":"#DIV/0!"}},{"$f":"ROUND(1/360*事前相談チェックシート!$R$12*mkrain!$G67*事前相談チェックシート!$M$28,5)","v":{"$error":"#DIV/0!"}}]
["10:50:00",{"$f":"ROUND(1/360*事前相談チェックシート!$R$10*mkrain!$G68*事前相談チェックシート!$L$28,5)","v":{"$error":"#DIV/0!"}},{"$f":"ROUND(1/360*事前相談チェックシート!$R$12*mkrain!$G68*事前相談チェックシート!$M$28,5)","v":{"$error":"#DIV/0!"}}]
["11:00:00",{"$f":"ROUND(1/360*事前相談チェックシート!$R$10*mkrain!$G69*事前相談チェックシート!$L$28,5)","v":{"$error":"#DIV/0!"}},{"$f":"ROUND(1/360*事前相談チェックシート!$R$12*mkrain!$G69*事前相談チェックシート!$M$28,5)","v":{"$error":"#DIV/0!"}}]
["11:10:00",{"$f":"ROUND(1/360*事前相談チェックシート!$R$10*mkrain!$G70*事前相談チェックシート!$L$28,5)","v":{"$error":"#DIV/0!"}},{"$f":"ROUND(1/360*事前相談チェックシート!$R$12*mkrain!$G70*事前相談チェックシート!$M$28,5)","v":{"$error":"#DIV/0!"}}]
["11:20:00",{"$f":"ROUND(1/360*事前相談チェックシート!$R$10*mkrain!$G71*事前相談チェックシート!$L$28,5)","v":{"$error":"#DIV/0!"}},{"$f":"ROUND(1/360*事前相談チェックシート!$R$12*mkrain!$G71*事前相談チェックシート!$M$28,5)","v":{"$error":"#DIV/0!"}}]
["11:30:00",{"$f":"ROUND(1/360*事前相談チェックシート!$R$10*mkrain!$G72*事前相談チェックシート!$L$28,5)","v":{"$error":"#DIV/0!"}},{"$f":"ROUND(1/360*事前相談チェックシート!$R$12*mkrain!$G72*事前相談チェックシート!$M$28,5)","v":{"$error":"#DIV/0!"}}]
["11:40:00",{"$f":"ROUND(1/360*事前相談チェックシート!$R$10*mkrain!$G73*事前相談チェックシート!$L$28,5)","v":{"$error":"#DIV/0!"}},{"$f":"ROUND(1/360*事前相談チェックシート!$R$12*mkrain!$G73*事前相談チェックシート!$M$28,5)","v":{"$error":"#DIV/0!"}}]
["11:50:00",{"$f":"ROUND(1/360*事前相談チェックシート!$R$10*mkrain!$G74*事前相談チェックシート!$L$28,5)","v":{"$error":"#DIV/0!"}},{"$f":"ROUND(1/360*事前相談チェックシート!$R$12*mkrain!$G74*事前相談チェックシート!$M$28,5)","v":{"$error":"#DIV/0!"}}]
["12:00:00",{"$f":"ROUND(1/360*事前相談チェックシート!$R$10*mkrain!$G75*事前相談チェックシート!$L$28,5)","v":{"$error":"#DIV/0!"}},{"$f":"ROUND(1/360*事前相談チェックシート!$R$12*mkrain!$G75*事前相談チェックシート!$M$28,5)","v":{"$error":"#DIV/0!"}}]
["12:10:00",{"$f":"ROUND(1/360*事前相談チェックシート!$R$10*mkrain!$G76*事前相談チェックシート!$L$28,5)","v":{"$error":"#DIV/0!"}},{"$f":"ROUND(1/360*事前相談チェックシート!$R$12*mkrain!$G76*事前相談チェックシート!$M$28,5)","v":{"$error":"#DIV/0!"}}]
["12:20:00",{"$f":"ROUND(1/360*事前相談チェックシート!$R$10*mkrain!$G77*事前相談チェックシート!$L$28,5)","v":{"$error":"#DIV/0!"}},{"$f":"ROUND(1/360*事前相談チェックシート!$R$12*mkrain!$G77*事前相談チェックシート!$M$28,5)","v":{"$error":"#DIV/0!"}}]
["12:30:00",{"$f":"ROUND(1/360*事前相談チェックシート!$R$10*mkrain!$G78*事前相談チェックシート!$L$28,5)","v":{"$error":"#DIV/0!"}},{"$f":"ROUND(1/360*事前相談チェックシート!$R$12*mkrain!$G78*事前相談チェックシート!$M$28,5)","v":{"$error":"#DIV/0!"}}]
["12:40:00",{"$f":"ROUND(1/360*事前相談チェックシート!$R$10*mkrain!$G79*事前相談チェックシート!$L$28,5)","v":{"$error":"#DIV/0!"}},{"$f":"ROUND(1/360*事前相談チェックシート!$R$12*mkrain!$G79*事前相談チェックシート!$M$28,5)","v":{"$error":"#DIV/0!"}}]
["12:50:00",{"$f":"ROUND(1/360*事前相談チェックシート!$R$10*mkrain!$G80*事前相談チェックシート!$L$28,5)","v":{"$error":"#DIV/0!"}},{"$f":"ROUND(1/360*事前相談チェックシート!$R$12*mkrain!$G80*事前相談チェックシート!$M$28,5)","v":{"$error":"#DIV/0!"}}]
["13:00:00",{"$f":"ROUND(1/360*事前相談チェックシート!$R$10*mkrain!$G81*事前相談チェックシート!$L$28,5)","v":{"$error":"#DIV/0!"}},{"$f":"ROUND(1/360*事前相談チェックシート!$R$12*mkrain!$G81*事前相談チェックシート!$M$28,5)","v":{"$error":"#DIV/0!"}}]
["13:10:00",{"$f":"ROUND(1/360*事前相談チェックシート!$R$10*mkrain!$G82*事前相談チェックシート!$L$28,5)","v":{"$error":"#DIV/0!"}},{"$f":"ROUND(1/360*事前相談チェックシート!$R$12*mkrain!$G82*事前相談チェックシート!$M$28,5)","v":{"$error":"#DIV/0!"}}]
["13:20:00",{"$f":"ROUND(1/360*事前相談チェックシート!$R$10*mkrain!$G83*事前相談チェックシート!$L$28,5)","v":{"$error":"#DIV/0!"}},{"$f":"ROUND(1/360*事前相談チェックシート!$R$12*mkrain!$G83*事前相談チェックシート!$M$28,5)","v":{"$error":"#DIV/0!"}}]
["13:30:00",{"$f":"ROUND(1/360*事前相談チェックシート!$R$10*mkrain!$G84*事前相談チェックシート!$L$28,5)","v":{"$error":"#DIV/0!"}},{"$f":"ROUND(1/360*事前相談チェックシート!$R$12*mkrain!$G84*事前相談チェックシート!$M$28,5)","v":{"$error":"#DIV/0!"}}]
["13:40:00",{"$f":"ROUND(1/360*事前相談チェックシート!$R$10*mkrain!$G85*事前相談チェックシート!$L$28,5)","v":{"$error":"#DIV/0!"}},{"$f":"ROUND(1/360*事前相談チェックシート!$R$12*mkrain!$G85*事前相談チェックシート!$M$28,5)","v":{"$error":"#DIV/0!"}}]
["13:50:00",{"$f":"ROUND(1/360*事前相談チェックシート!$R$10*mkrain!$G86*事前相談チェックシート!$L$28,5)","v":{"$error":"#DIV/0!"}},{"$f":"ROUND(1/360*事前相談チェックシート!$R$12*mkrain!$G86*事前相談チェックシート!$M$28,5)","v":{"$error":"#DIV/0!"}}]
["14:00:00",{"$f":"ROUND(1/360*事前相談チェックシート!$R$10*mkrain!$G87*事前相談チェックシート!$L$28,5)","v":{"$error":"#DIV/0!"}},{"$f":"ROUND(1/360*事前相談チェックシート!$R$12*mkrain!$G87*事前相談チェックシート!$M$28,5)","v":{"$error":"#DIV/0!"}}]
["14:10:00",{"$f":"ROUND(1/360*事前相談チェックシート!$R$10*mkrain!$G88*事前相談チェックシート!$L$28,5)","v":{"$error":"#DIV/0!"}},{"$f":"ROUND(1/360*事前相談チェックシート!$R$12*mkrain!$G88*事前相談チェックシート!$M$28,5)","v":{"$error":"#DIV/0!"}}]
["14:20:00",{"$f":"ROUND(1/360*事前相談チェックシート!$R$10*mkrain!$G89*事前相談チェックシート!$L$28,5)","v":{"$error":"#DIV/0!"}},{"$f":"ROUND(1/360*事前相談チェックシート!$R$12*mkrain!$G89*事前相談チェックシート!$M$28,5)","v":{"$error":"#DIV/0!"}}]
["14:30:00",{"$f":"ROUND(1/360*事前相談チェックシート!$R$10*mkrain!$G90*事前相談チェックシート!$L$28,5)","v":{"$error":"#DIV/0!"}},{"$f":"ROUND(1/360*事前相談チェックシート!$R$12*mkrain!$G90*事前相談チェックシート!$M$28,5)","v":{"$error":"#DIV/0!"}}]
["14:40:00",{"$f":"ROUND(1/360*事前相談チェックシート!$R$10*mkrain!$G91*事前相談チェックシート!$L$28,5)","v":{"$error":"#DIV/0!"}},{"$f":"ROUND(1/360*事前相談チェックシート!$R$12*mkrain!$G91*事前相談チェックシート!$M$28,5)","v":{"$error":"#DIV/0!"}}]
["14:50:00",{"$f":"ROUND(1/360*事前相談チェックシート!$R$10*mkrain!$G92*事前相談チェックシート!$L$28,5)","v":{"$error":"#DIV/0!"}},{"$f":"ROUND(1/360*事前相談チェックシート!$R$12*mkrain!$G92*事前相談チェックシート!$M$28,5)","v":{"$error":"#DIV/0!"}}]
["15:00:00",{"$f":"ROUND(1/360*事前相談チェックシート!$R$10*mkrain!$G93*事前相談チェックシート!$L$28,5)","v":{"$error":"#DIV/0!"}},{"$f":"ROUND(1/360*事前相談チェックシート!$R$12*mkrain!$G93*事前相談チェックシート!$M$28,5)","v":{"$error":"#DIV/0!"}}]
["15:10:00",{"$f":"ROUND(1/360*事前相談チェックシート!$R$10*mkrain!$G94*事前相談チェックシート!$L$28,5)","v":{"$error":"#DIV/0!"}},{"$f":"ROUND(1/360*事前相談チェックシート!$R$12*mkrain!$G94*事前相談チェックシート!$M$28,5)","v":{"$error":"#DIV/0!"}}]
["15:20:00",{"$f":"ROUND(1/360*事前相談チェックシート!$R$10*mkrain!$G95*事前相談チェックシート!$L$28,5)","v":{"$error":"#DIV/0!"}},{"$f":"ROUND(1/360*事前相談チェックシート!$R$12*mkrain!$G95*事前相談チェックシート!$M$28,5)","v":{"$error":"#DIV/0!"}}]
["15:30:00",{"$f":"ROUND(1/360*事前相談チェックシート!$R$10*mkrain!$G96*事前相談チェックシート!$L$28,5)","v":{"$error":"#DIV/0!"}},{"$f":"ROUND(1/360*事前相談チェックシート!$R$12*mkrain!$G96*事前相談チェックシート!$M$28,5)","v":{"$error":"#DIV/0!"}}]
["15:40:00",{"$f":"ROUND(1/360*事前相談チェックシート!$R$10*mkrain!$G97*事前相談チェックシート!$L$28,5)","v":{"$error":"#DIV/0!"}},{"$f":"ROUND(1/360*事前相談チェックシート!$R$12*mkrain!$G97*事前相談チェックシート!$M$28,5)","v":{"$error":"#DIV/0!"}}]
["15:50:00",{"$f":"ROUND(1/360*事前相談チェックシート!$R$10*mkrain!$G98*事前相談チェックシート!$L$28,5)","v":{"$error":"#DIV/0!"}},{"$f":"ROUND(1/360*事前相談チェックシート!$R$12*mkrain!$G98*事前相談チェックシート!$M$28,5)","v":{"$error":"#DIV/0!"}}]
["16:00:00",{"$f":"ROUND(1/360*事前相談チェックシート!$R$10*mkrain!$G99*事前相談チェックシート!$L$28,5)","v":{"$error":"#DIV/0!"}},{"$f":"ROUND(1/360*事前相談チェックシート!$R$12*mkrain!$G99*事前相談チェックシート!$M$28,5)","v":{"$error":"#DIV/0!"}}]
["16:10:00",{"$f":"ROUND(1/360*事前相談チェックシート!$R$10*mkrain!$G100*事前相談チェックシート!$L$28,5)","v":{"$error":"#DIV/0!"}},{"$f":"ROUND(1/360*事前相談チェックシート!$R$12*mkrain!$G100*事前相談チェックシート!$M$28,5)","v":{"$error":"#DIV/0!"}}]
["16:20:00",{"$f":"ROUND(1/360*事前相談チェックシート!$R$10*mkrain!$G101*事前相談チェックシート!$L$28,5)","v":{"$error":"#DIV/0!"}},{"$f":"ROUND(1/360*事前相談チェックシート!$R$12*mkrain!$G101*事前相談チェックシート!$M$28,5)","v":{"$error":"#DIV/0!"}}]
["16:30:00",{"$f":"ROUND(1/360*事前相談チェックシート!$R$10*mkrain!$G102*事前相談チェックシート!$L$28,5)","v":{"$error":"#DIV/0!"}},{"$f":"ROUND(1/360*事前相談チェックシート!$R$12*mkrain!$G102*事前相談チェックシート!$M$28,5)","v":{"$error":"#DIV/0!"}}]
["16:40:00",{"$f":"ROUND(1/360*事前相談チェックシート!$R$10*mkrain!$G103*事前相談チェックシート!$L$28,5)","v":{"$error":"#DIV/0!"}},{"$f":"ROUND(1/360*事前相談チェックシート!$R$12*mkrain!$G103*事前相談チェックシート!$M$28,5)","v":{"$error":"#DIV/0!"}}]
["16:50:00",{"$f":"ROUND(1/360*事前相談チェックシート!$R$10*mkrain!$G104*事前相談チェックシート!$L$28,5)","v":{"$error":"#DIV/0!"}},{"$f":"ROUND(1/360*事前相談チェックシート!$R$12*mkrain!$G104*事前相談チェックシート!$M$28,5)","v":{"$error":"#DIV/0!"}}]
["17:00:00",{"$f":"ROUND(1/360*事前相談チェックシート!$R$10*mkrain!$G105*事前相談チェックシート!$L$28,5)","v":{"$error":"#DIV/0!"}},{"$f":"ROUND(1/360*事前相談チェックシート!$R$12*mkrain!$G105*事前相談チェックシート!$M$28,5)","v":{"$error":"#DIV/0!"}}]
["17:10:00",{"$f":"ROUND(1/360*事前相談チェックシート!$R$10*mkrain!$G106*事前相談チェックシート!$L$28,5)","v":{"$error":"#DIV/0!"}},{"$f":"ROUND(1/360*事前相談チェックシート!$R$12*mkrain!$G106*事前相談チェックシート!$M$28,5)","v":{"$error":"#DIV/0!"}}]
["17:20:00",{"$f":"ROUND(1/360*事前相談チェックシート!$R$10*mkrain!$G107*事前相談チェックシート!$L$28,5)","v":{"$error":"#DIV/0!"}},{"$f":"ROUND(1/360*事前相談チェックシート!$R$12*mkrain!$G107*事前相談チェックシート!$M$28,5)","v":{"$error":"#DIV/0!"}}]
["17:30:00",{"$f":"ROUND(1/360*事前相談チェックシート!$R$10*mkrain!$G108*事前相談チェックシート!$L$28,5)","v":{"$error":"#DIV/0!"}},{"$f":"ROUND(1/360*事前相談チェックシート!$R$12*mkrain!$G108*事前相談チェックシート!$M$28,5)","v":{"$error":"#DIV/0!"}}]
["17:40:00",{"$f":"ROUND(1/360*事前相談チェックシート!$R$10*mkrain!$G109*事前相談チェックシート!$L$28,5)","v":{"$error":"#DIV/0!"}},{"$f":"ROUND(1/360*事前相談チェックシート!$R$12*mkrain!$G109*事前相談チェックシート!$M$28,5)","v":{"$error":"#DIV/0!"}}]
["17:50:00",{"$f":"ROUND(1/360*事前相談チェックシート!$R$10*mkrain!$G110*事前相談チェックシート!$L$28,5)","v":{"$error":"#DIV/0!"}},{"$f":"ROUND(1/360*事前相談チェックシート!$R$12*mkrain!$G110*事前相談チェックシート!$M$28,5)","v":{"$error":"#DIV/0!"}}]
["18:00:00",{"$f":"ROUND(1/360*事前相談チェックシート!$R$10*mkrain!$G111*事前相談チェックシート!$L$28,5)","v":{"$error":"#DIV/0!"}},{"$f":"ROUND(1/360*事前相談チェックシート!$R$12*mkrain!$G111*事前相談チェックシート!$M$28,5)","v":{"$error":"#DIV/0!"}}]
["18:10:00",{"$f":"ROUND(1/360*事前相談チェックシート!$R$10*mkrain!$G112*事前相談チェックシート!$L$28,5)","v":{"$error":"#DIV/0!"}},{"$f":"ROUND(1/360*事前相談チェックシート!$R$12*mkrain!$G112*事前相談チェックシート!$M$28,5)","v":{"$error":"#DIV/0!"}}]
["18:20:00",{"$f":"ROUND(1/360*事前相談チェックシート!$R$10*mkrain!$G113*事前相談チェックシート!$L$28,5)","v":{"$error":"#DIV/0!"}},{"$f":"ROUND(1/360*事前相談チェックシート!$R$12*mkrain!$G113*事前相談チェックシート!$M$28,5)","v":{"$error":"#DIV/0!"}}]
["18:30:00",{"$f":"ROUND(1/360*事前相談チェックシート!$R$10*mkrain!$G114*事前相談チェックシート!$L$28,5)","v":{"$error":"#DIV/0!"}},{"$f":"ROUND(1/360*事前相談チェックシート!$R$12*mkrain!$G114*事前相談チェックシート!$M$28,5)","v":{"$error":"#DIV/0!"}}]
["18:40:00",{"$f":"ROUND(1/360*事前相談チェックシート!$R$10*mkrain!$G115*事前相談チェックシート!$L$28,5)","v":{"$error":"#DIV/0!"}},{"$f":"ROUND(1/360*事前相談チェックシート!$R$12*mkrain!$G115*事前相談チェックシート!$M$28,5)","v":{"$error":"#DIV/0!"}}]
["18:50:00",{"$f":"ROUND(1/360*事前相談チェックシート!$R$10*mkrain!$G116*事前相談チェックシート!$L$28,5)","v":{"$error":"#DIV/0!"}},{"$f":"ROUND(1/360*事前相談チェックシート!$R$12*mkrain!$G116*事前相談チェックシート!$M$28,5)","v":{"$error":"#DIV/0!"}}]
["19:00:00",{"$f":"ROUND(1/360*事前相談チェックシート!$R$10*mkrain!$G117*事前相談チェックシート!$L$28,5)","v":{"$error":"#DIV/0!"}},{"$f":"ROUND(1/360*事前相談チェックシート!$R$12*mkrain!$G117*事前相談チェックシート!$M$28,5)","v":{"$error":"#DIV/0!"}}]
["19:10:00",{"$f":"ROUND(1/360*事前相談チェックシート!$R$10*mkrain!$G118*事前相談チェックシート!$L$28,5)","v":{"$error":"#DIV/0!"}},{"$f":"ROUND(1/360*事前相談チェックシート!$R$12*mkrain!$G118*事前相談チェックシート!$M$28,5)","v":{"$error":"#DIV/0!"}}]
["19:20:00",{"$f":"ROUND(1/360*事前相談チェックシート!$R$10*mkrain!$G119*事前相談チェックシート!$L$28,5)","v":{"$error":"#DIV/0!"}},{"$f":"ROUND(1/360*事前相談チェックシート!$R$12*mkrain!$G119*事前相談チェックシート!$M$28,5)","v":{"$error":"#DIV/0!"}}]
["19:30:00",{"$f":"ROUND(1/360*事前相談チェックシート!$R$10*mkrain!$G120*事前相談チェックシート!$L$28,5)","v":{"$error":"#DIV/0!"}},{"$f":"ROUND(1/360*事前相談チェックシート!$R$12*mkrain!$G120*事前相談チェックシート!$M$28,5)","v":{"$error":"#DIV/0!"}}]
["19:40:00",{"$f":"ROUND(1/360*事前相談チェックシート!$R$10*mkrain!$G121*事前相談チェックシート!$L$28,5)","v":{"$error":"#DIV/0!"}},{"$f":"ROUND(1/360*事前相談チェックシート!$R$12*mkrain!$G121*事前相談チェックシート!$M$28,5)","v":{"$error":"#DIV/0!"}}]
["19:50:00",{"$f":"ROUND(1/360*事前相談チェックシート!$R$10*mkrain!$G122*事前相談チェックシート!$L$28,5)","v":{"$error":"#DIV/0!"}},{"$f":"ROUND(1/360*事前相談チェックシート!$R$12*mkrain!$G122*事前相談チェックシート!$M$28,5)","v":{"$error":"#DIV/0!"}}]
["20:00:00",{"$f":"ROUND(1/360*事前相談チェックシート!$R$10*mkrain!$G123*事前相談チェックシート!$L$28,5)","v":{"$error":"#DIV/0!"}},{"$f":"ROUND(1/360*事前相談チェックシート!$R$12*mkrain!$G123*事前相談チェックシート!$M$28,5)","v":{"$error":"#DIV/0!"}}]
["20:10:00",{"$f":"ROUND(1/360*事前相談チェックシート!$R$10*mkrain!$G124*事前相談チェックシート!$L$28,5)","v":{"$error":"#DIV/0!"}},{"$f":"ROUND(1/360*事前相談チェックシート!$R$12*mkrain!$G124*事前相談チェックシート!$M$28,5)","v":{"$error":"#DIV/0!"}}]
["20:20:00",{"$f":"ROUND(1/360*事前相談チェックシート!$R$10*mkrain!$G125*事前相談チェックシート!$L$28,5)","v":{"$error":"#DIV/0!"}},{"$f":"ROUND(1/360*事前相談チェックシート!$R$12*mkrain!$G125*事前相談チェックシート!$M$28,5)","v":{"$error":"#DIV/0!"}}]
["20:30:00",{"$f":"ROUND(1/360*事前相談チェックシート!$R$10*mkrain!$G126*事前相談チェックシート!$L$28,5)","v":{"$error":"#DIV/0!"}},{"$f":"ROUND(1/360*事前相談チェックシート!$R$12*mkrain!$G126*事前相談チェックシート!$M$28,5)","v":{"$error":"#DIV/0!"}}]
["20:40:00",{"$f":"ROUND(1/360*事前相談チェックシート!$R$10*mkrain!$G127*事前相談チェックシート!$L$28,5)","v":{"$error":"#DIV/0!"}},{"$f":"ROUND(1/360*事前相談チェックシート!$R$12*mkrain!$G127*事前相談チェックシート!$M$28,5)","v":{"$error":"#DIV/0!"}}]
["20:50:00",{"$f":"ROUND(1/360*事前相談チェックシート!$R$10*mkrain!$G128*事前相談チェックシート!$L$28,5)","v":{"$error":"#DIV/0!"}},{"$f":"ROUND(1/360*事前相談チェックシート!$R$12*mkrain!$G128*事前相談チェックシート!$M$28,5)","v":{"$error":"#DIV/0!"}}]
["21:00:00",{"$f":"ROUND(1/360*事前相談チェックシート!$R$10*mkrain!$G129*事前相談チェックシート!$L$28,5)","v":{"$error":"#DIV/0!"}},{"$f":"ROUND(1/360*事前相談チェックシート!$R$12*mkrain!$G129*事前相談チェックシート!$M$28,5)","v":{"$error":"#DIV/0!"}}]
["21:10:00",{"$f":"ROUND(1/360*事前相談チェックシート!$R$10*mkrain!$G130*事前相談チェックシート!$L$28,5)","v":{"$error":"#DIV/0!"}},{"$f":"ROUND(1/360*事前相談チェックシート!$R$12*mkrain!$G130*事前相談チェックシート!$M$28,5)","v":{"$error":"#DIV/0!"}}]
["21:20:00",{"$f":"ROUND(1/360*事前相談チェックシート!$R$10*mkrain!$G131*事前相談チェックシート!$L$28,5)","v":{"$error":"#DIV/0!"}},{"$f":"ROUND(1/360*事前相談チェックシート!$R$12*mkrain!$G131*事前相談チェックシート!$M$28,5)","v":{"$error":"#DIV/0!"}}]
["21:30:00",{"$f":"ROUND(1/360*事前相談チェックシート!$R$10*mkrain!$G132*事前相談チェックシート!$L$28,5)","v":{"$error":"#DIV/0!"}},{"$f":"ROUND(1/360*事前相談チェックシート!$R$12*mkrain!$G132*事前相談チェックシート!$M$28,5)","v":{"$error":"#DIV/0!"}}]
["21:40:00",{"$f":"ROUND(1/360*事前相談チェックシート!$R$10*mkrain!$G133*事前相談チェックシート!$L$28,5)","v":{"$error":"#DIV/0!"}},{"$f":"ROUND(1/360*事前相談チェックシート!$R$12*mkrain!$G133*事前相談チェックシート!$M$28,5)","v":{"$error":"#DIV/0!"}}]
["21:50:00",{"$f":"ROUND(1/360*事前相談チェックシート!$R$10*mkrain!$G134*事前相談チェックシート!$L$28,5)","v":{"$error":"#DIV/0!"}},{"$f":"ROUND(1/360*事前相談チェックシート!$R$12*mkrain!$G134*事前相談チェックシート!$M$28,5)","v":{"$error":"#DIV/0!"}}]
["22:00:00",{"$f":"ROUND(1/360*事前相談チェックシート!$R$10*mkrain!$G135*事前相談チェックシート!$L$28,5)","v":{"$error":"#DIV/0!"}},{"$f":"ROUND(1/360*事前相談チェックシート!$R$12*mkrain!$G135*事前相談チェックシート!$M$28,5)","v":{"$error":"#DIV/0!"}}]
["22:10:00",{"$f":"ROUND(1/360*事前相談チェックシート!$R$10*mkrain!$G136*事前相談チェックシート!$L$28,5)","v":{"$error":"#DIV/0!"}},{"$f":"ROUND(1/360*事前相談チェックシート!$R$12*mkrain!$G136*事前相談チェックシート!$M$28,5)","v":{"$error":"#DIV/0!"}}]
["22:20:00",{"$f":"ROUND(1/360*事前相談チェックシート!$R$10*mkrain!$G137*事前相談チェックシート!$L$28,5)","v":{"$error":"#DIV/0!"}},{"$f":"ROUND(1/360*事前相談チェックシート!$R$12*mkrain!$G137*事前相談チェックシート!$M$28,5)","v":{"$error":"#DIV/0!"}}]
["22:30:00",{"$f":"ROUND(1/360*事前相談チェックシート!$R$10*mkrain!$G138*事前相談チェックシート!$L$28,5)","v":{"$error":"#DIV/0!"}},{"$f":"ROUND(1/360*事前相談チェックシート!$R$12*mkrain!$G138*事前相談チェックシート!$M$28,5)","v":{"$error":"#DIV/0!"}}]
["22:40:00",{"$f":"ROUND(1/360*事前相談チェックシート!$R$10*mkrain!$G139*事前相談チェックシート!$L$28,5)","v":{"$error":"#DIV/0!"}},{"$f":"ROUND(1/360*事前相談チェックシート!$R$12*mkrain!$G139*事前相談チェックシート!$M$28,5)","v":{"$error":"#DIV/0!"}}]
["22:50:00",{"$f":"ROUND(1/360*事前相談チェックシート!$R$10*mkrain!$G140*事前相談チェックシート!$L$28,5)","v":{"$error":"#DIV/0!"}},{"$f":"ROUND(1/360*事前相談チェックシート!$R$12*mkrain!$G140*事前相談チェックシート!$M$28,5)","v":{"$error":"#DIV/0!"}}]
["23:00:00",{"$f":"ROUND(1/360*事前相談チェックシート!$R$10*mkrain!$G141*事前相談チェックシート!$L$28,5)","v":{"$error":"#DIV/0!"}},{"$f":"ROUND(1/360*事前相談チェックシート!$R$12*mkrain!$G141*事前相談チェックシート!$M$28,5)","v":{"$error":"#DIV/0!"}}]
["23:10:00",{"$f":"ROUND(1/360*事前相談チェックシート!$R$10*mkrain!$G142*事前相談チェックシート!$L$28,5)","v":{"$error":"#DIV/0!"}},{"$f":"ROUND(1/360*事前相談チェックシート!$R$12*mkrain!$G142*事前相談チェックシート!$M$28,5)","v":{"$error":"#DIV/0!"}}]
["23:20:00",{"$f":"ROUND(1/360*事前相談チェックシート!$R$10*mkrain!$G143*事前相談チェックシート!$L$28,5)","v":{"$error":"#DIV/0!"}},{"$f":"ROUND(1/360*事前相談チェックシート!$R$12*mkrain!$G143*事前相談チェックシート!$M$28,5)","v":{"$error":"#DIV/0!"}}]
["23:30:00",{"$f":"ROUND(1/360*事前相談チェックシート!$R$10*mkrain!$G144*事前相談チェックシート!$L$28,5)","v":{"$error":"#DIV/0!"}},{"$f":"ROUND(1/360*事前相談チェックシート!$R$12*mkrain!$G144*事前相談チェックシート!$M$28,5)","v":{"$error":"#DIV/0!"}}]
["23:40:00",{"$f":"ROUND(1/360*事前相談チェックシート!$R$10*mkrain!$G145*事前相談チェックシート!$L$28,5)","v":{"$error":"#DIV/0!"}},{"$f":"ROUND(1/360*事前相談チェックシート!$R$12*mkrain!$G145*事前相談チェックシート!$M$28,5)","v":{"$error":"#DIV/0!"}}]
["23:50:00",{"$f":"ROUND(1/360*事前相談チェックシート!$R$10*mkrain!$G146*事前相談チェックシート!$L$28,5)","v":{"$error":"#DIV/0!"}},{"$f":"ROUND(1/360*事前相談チェックシート!$R$12*mkrain!$G146*事前相談チェックシート!$M$28,5)","v":{"$error":"#DIV/0!"}}]
[1,{"$f":"ROUND(1/360*事前相談チェックシート!$R$10*mkrain!$G147*事前相談チェックシート!$L$28,5)","v":{"$error":"#DIV/0!"}},{"$f":"ROUND(1/360*事前相談チェックシート!$R$12*mkrain!$G147*事前相談チェックシート!$M$28,5)","v":{"$error":"#DIV/0!"}}]

{"sheet":"逐次計算（概算）","index":16,"n_rows":147,"n_cols":5,"rows_kept":147,"cut":false,"hidden":true,"merged":[]}
["時刻","行為後流入量","許容放流量","調整池水位","調節後放流量"]
[]
[{"$f":"runoff!A4","v":"00:00:00"},{"$f":"runoff!C4","v":0},{"$f":"runoff!$B$1","v":{"$error":"#DIV/0!"}},0,0]
[{"$f":"runoff!A5","v":"00:10:00"},{"$f":"runoff!C5","v":{"$error":"#DIV/0!"}},{"$f":"runoff!$B$1","v":{"$error":"#DIV/0!"}},4.6834226502474293E-3,1.0258425779723708E-4]
[{"$f":"runoff!A6","v":"00:20:00"},{"$f":"runoff!C6","v":{"$error":"#DIV/0!"}},{"$f":"runoff!$B$1","v":{"$error":"#DIV/0!"}},1.3851594482178856E-2,5.3304343968467525E-4]
[{"$f":"runoff!A7","v":"00:30:00"},{"$f":"runoff!C7","v":{"$error":"#DIV/0!"}},{"$f":"runoff!$B$1","v":{"$error":"#DIV/0!"}},2.2669774698385839E-2,1.1108994252001995E-3]
[{"$f":"runoff!A8","v":"00:40:00"},{"$f":"runoff!C8","v":{"$error":"#DIV/0!"}},{"$f":"runoff!$B$1","v":{"$error":"#DIV/0!"}},3.103115143351496E-2,1.7727843153533718E-3]
[{"$f":"runoff!A9","v":"00:50:00"},{"$f":"runoff!C9","v":{"$error":"#DIV/0!"}},{"$f":"runoff!$B$1","v":{"$error":"#DIV/0!"}},3.8874452751372787E-2,2.4833961626213349E-3]
[{"$f":"runoff!A10","v":"01:00:00"},{"$f":"runoff!C10","v":{"$error":"#DIV/0!"}},{"$f":"runoff!$B$1","v":{"$error":"#DIV/0!"}},4.6165921164367713E-2,3.2184222758896543E-3]
[{"$f":"runoff!A11","v":"01:10:00"},{"$f":"runoff!C11","v":{"$error":"#DIV/0!"}},{"$f":"runoff!$B$1","v":{"$error":"#DIV/0!"}},5.2788730326979602E-2,3.9321578717845963E-3]
[{"$f":"runoff!A12","v":"01:20:00"},{"$f":"runoff!C12","v":{"$error":"#DIV/0!"}},{"$f":"runoff!$B$1","v":{"$error":"#DIV/0!"}},5.8873482764609429E-2,4.6342118466841178E-3]
[{"$f":"runoff!A13","v":"01:30:00"},{"$f":"runoff!C13","v":{"$error":"#DIV/0!"}},{"$f":"runoff!$B$1","v":{"$error":"#DIV/0!"}},6.4436215501205291E-2,5.3132005573581897E-3]
[{"$f":"runoff!A14","v":"01:40:00"},{"$f":"runoff!C14","v":{"$error":"#DIV/0!"}},{"$f":"runoff!$B$1","v":{"$error":"#DIV/0!"}},6.9502612091435559E-2,5.9596068304762148E-3]
[{"$f":"runoff!A15","v":"01:50:00"},{"$f":"runoff!C15","v":{"$error":"#DIV/0!"}},{"$f":"runoff!$B$1","v":{"$error":"#DIV/0!"}},7.4113931255851251E-2,6.5492016466231328E-3]
[{"$f":"runoff!A16","v":"02:00:00"},{"$f":"runoff!C16","v":{"$error":"#DIV/0!"}},{"$f":"runoff!$B$1","v":{"$error":"#DIV/0!"}},7.8311023227962046E-2,7.1070990804701414E-3]
[{"$f":"runoff!A17","v":"02:10:00"},{"$f":"runoff!C17","v":{"$error":"#DIV/0!"}},{"$f":"runoff!$B$1","v":{"$error":"#DIV/0!"}},8.2117336963941925E-2,7.6458878249067693E-3]
[{"$f":"runoff!A18","v":"02:20:00"},{"$f":"runoff!C18","v":{"$error":"#DIV/0!"}},{"$f":"runoff!$B$1","v":{"$error":"#DIV/0!"}},8.5567861869785267E-2,8.1279748790993398E-3]
[{"$f":"runoff!A19","v":"02:30:00"},{"$f":"runoff!C19","v":{"$error":"#DIV/0!"}},{"$f":"runoff!$B$1","v":{"$error":"#DIV/0!"}},8.8816023944845376E-2,8.5843406249370841E-3]
[{"$f":"runoff!A20","v":"02:40:00"},{"$f":"runoff!C20","v":{"$error":"#DIV/0!"}},{"$f":"runoff!$B$1","v":{"$error":"#DIV/0!"}},9.1771137155323312E-2,9.0129140856940754E-3]
[{"$f":"runoff!A21","v":"02:50:00"},{"$f":"runoff!C21","v":{"$error":"#DIV/0!"}},{"$f":"runoff!$B$1","v":{"$error":"#DIV/0!"}},9.4459711882743116E-2,9.411840671563006E-3]
[{"$f":"runoff!A22","v":"03:00:00"},{"$f":"runoff!C22","v":{"$error":"#DIV/0!"}},{"$f":"runoff!$B$1","v":{"$error":"#DIV/0!"}},9.6901337997396447E-2,9.7979694133547846E-3]
[{"$f":"runoff!A23","v":"03:10:00"},{"$f":"runoff!C23","v":{"$error":"#DIV/0!"}},{"$f":"runoff!$B$1","v":{"$error":"#DIV/0!"}},9.9125491671069876E-2,1.0133030960352779E-2]
[{"$f":"runoff!A24","v":"03:20:00"},{"$f":"runoff!C24","v":{"$error":"#DIV/0!"}},{"$f":"runoff!$B$1","v":{"$error":"#DIV/0!"}},0.10126940332089091,1.0471827131701684E-2]
[{"$f":"runoff!A25","v":"03:30:00"},{"$f":"runoff!C25","v":{"$error":"#DIV/0!"}},{"$f":"runoff!$B$1","v":{"$error":"#DIV/0!"}},0.10323190699529636,1.0776081573753161E-2]
[{"$f":"runoff!A26","v":"03:40:00"},{"$f":"runoff!C26","v":{"$error":"#DIV/0!"}},{"$f":"runoff!$B$1","v":{"$error":"#DIV/0!"}},0.10504540323674845,1.1044676569767301E-2]
[{"$f":"runoff!A27","v":"03:50:00"},{"$f":"runoff!C27","v":{"$error":"#DIV/0!"}},{"$f":"runoff!$B$1","v":{"$error":"#DIV/0!"}},0.10683175597828427,1.1334892490238417E-2]
[{"$f":"runoff!A28","v":"04:00:00"},{"$f":"runoff!C28","v":{"$error":"#DIV/0!"}},{"$f":"runoff!$B$1","v":{"$error":"#DIV/0!"}},0.10847349090191741,1.1608015175223124E-2]
[{"$f":"runoff!A29","v":"04:10:00"},{"$f":"runoff!C29","v":{"$error":"#DIV/0!"}},{"$f":"runoff!$B$1","v":{"$error":"#DIV/0!"}},0.10999571183718417,1.1843839465032258E-2]
[{"$f":"runoff!A30","v":"04:20:00"},{"$f":"runoff!C30","v":{"$error":"#DIV/0!"}},{"$f":"runoff!$B$1","v":{"$error":"#DIV/0!"}},0.11153029080064895,1.2081239447460685E-2]
[{"$f":"runoff!A31","v":"04:30:00"},{"$f":"runoff!C31","v":{"$error":"#DIV/0!"}},{"$f":"runoff!$B$1","v":{"$error":"#DIV/0!"}},0.11306655466713655,1.2340188841816176E-2]
[{"$f":"runoff!A32","v":"04:40:00"},{"$f":"runoff!C32","v":{"$error":"#DIV/0!"}},{"$f":"runoff!$B$1","v":{"$error":"#DIV/0!"}},0.11459371565317436,1.2600962355101908E-2]
[{"$f":"runoff!A33","v":"04:50:00"},{"$f":"runoff!C33","v":{"$error":"#DIV/0!"}},{"$f":"runoff!$B$1","v":{"$error":"#DIV/0!"}},0.11611944789935673,1.2843284444836275E-2]
[{"$f":"runoff!A34","v":"05:00:00"},{"$f":"runoff!C34","v":{"$error":"#DIV/0!"}},{"$f":"runoff!$B$1","v":{"$error":"#DIV/0!"}},0.11765155958133924,1.3087140244201583E-2]
[{"$f":"runoff!A35","v":"05:10:00"},{"$f":"runoff!C35","v":{"$error":"#DIV/0!"}},{"$f":"runoff!$B$1","v":{"$error":"#DIV/0!"}},0.11916969592878207,1.3373564336338965E-2]
[{"$f":"runoff!A36","v":"05:20:00"},{"$f":"runoff!C36","v":{"$error":"#DIV/0!"}},{"$f":"runoff!$B$1","v":{"$error":"#DIV/0!"}},0.1206723383009566,1.3620710523949548E-2]
[{"$f":"runoff!A37","v":"05:30:00"},{"$f":"runoff!C37","v":{"$error":"#DIV/0!"}},{"$f":"runoff!$B$1","v":{"$error":"#DIV/0!"}},0.12217692082827017,1.3869360666871021E-2]
[{"$f":"runoff!A38","v":"05:40:00"},{"$f":"runoff!C38","v":{"$error":"#DIV/0!"}},{"$f":"runoff!$B$1","v":{"$error":"#DIV/0!"}},0.12368205941761674,1.4119505722878093E-2]
[{"$f":"runoff!A39","v":"05:50:00"},{"$f":"runoff!C39","v":{"$error":"#DIV/0!"}},{"$f":"runoff!$B$1","v":{"$error":"#DIV/0!"}},0.12518637824817794,1.4371136810906E-2]
[{"$f":"runoff!A40","v":"06:00:00"},{"$f":"runoff!C40","v":{"$error":"#DIV/0!"}},{"$f":"runoff!$B$1","v":{"$error":"#DIV/0!"}},0.12667874403384241,1.4645403986820953E-2]
[{"$f":"runoff!A41","v":"06:10:00"},{"$f":"runoff!C41","v":{"$error":"#DIV/0!"}},{"$f":"runoff!$B$1","v":{"$error":"#DIV/0!"}},0.12815774074956254,1.4900103129118769E-2]
[{"$f":"runoff!A42","v":"06:20:00"},{"$f":"runoff!C42","v":{"$error":"#DIV/0!"}},{"$f":"runoff!$B$1","v":{"$error":"#DIV/0!"}},0.12973722819456127,1.5177674073384049E-2]
[{"$f":"runoff!A43","v":"06:30:00"},{"$f":"runoff!C43","v":{"$error":"#DIV/0!"}},{"$f":"runoff!$B$1","v":{"$error":"#DIV/0!"}},0.13139591693295816,1.5478500326756019E-2]
[{"$f":"runoff!A44","v":"06:40:00"},{"$f":"runoff!C44","v":{"$error":"#DIV/0!"}},{"$f":"runoff!$B$1","v":{"$error":"#DIV/0!"}},0.1331221683726766,1.5781288220520683E-2]
[{"$f":"runoff!A45","v":"06:50:00"},{"$f":"runoff!C45","v":{"$error":"#DIV/0!"}},{"$f":"runoff!$B$1","v":{"$error":"#DIV/0!"}},0.13491417759672655,1.60860251273711E-2]
[{"$f":"runoff!A46","v":"07:00:00"},{"$f":"runoff!C46","v":{"$error":"#DIV/0!"}},{"$f":"runoff!$B$1","v":{"$error":"#DIV/0!"}},0.13674985836286979,1.643666654598519E-2]
[{"$f":"runoff!A47","v":"07:10:00"},{"$f":"runoff!C47","v":{"$error":"#DIV/0!"}},{"$f":"runoff!$B$1","v":{"$error":"#DIV/0!"}},0.13872224949870823,1.6789819326364887E-2]
[{"$f":"runoff!A48","v":"07:20:00"},{"$f":"runoff!C48","v":{"$error":"#DIV/0!"}},{"$f":"runoff!$B$1","v":{"$error":"#DIV/0!"}},0.14071365639349703,1.7145465734926046E-2]
[{"$f":"runoff!A49","v":"07:30:00"},{"$f":"runoff!C49","v":{"$error":"#DIV/0!"}},{"$f":"runoff!$B$1","v":{"$error":"#DIV/0!"}},0.14272178525036042,1.7503588408536632E-2]
[{"$f":"runoff!A50","v":"07:40:00"},{"$f":"runoff!C50","v":{"$error":"#DIV/0!"}},{"$f":"runoff!$B$1","v":{"$error":"#DIV/0!"}},0.14495424513870081,1.7909415166725843E-2]
[{"$f":"runoff!A51","v":"07:50:00"},{"$f":"runoff!C51","v":{"$error":"#DIV/0!"}},{"$f":"runoff!$B$1","v":{"$error":"#DIV/0!"}},0.1473665356163236,1.8363955465091477E-2]
[{"$f":"runoff!A52","v":"08:00:00"},{"$f":"runoff!C52","v":{"$error":"#DIV/0!"}},{"$f":"runoff!$B$1","v":{"$error":"#DIV/0!"}},0.14981904352228109,1.8822277405333876E-2]
[{"$f":"runoff!A53","v":"08:10:00"},{"$f":"runoff!C53","v":{"$error":"#DIV/0!"}},{"$f":"runoff!$B$1","v":{"$error":"#DIV/0!"}},0.15240225591018003,1.9330762420885113E-2]
[{"$f":"runoff!A54","v":"08:20:00"},{"$f":"runoff!C54","v":{"$error":"#DIV/0!"}},{"$f":"runoff!$B$1","v":{"$error":"#DIV/0!"}},0.15509094449723257,1.9843745640501047E-2]
[{"$f":"runoff!A55","v":"08:30:00"},{"$f":"runoff!C55","v":{"$error":"#DIV/0!"}},{"$f":"runoff!$B$1","v":{"$error":"#DIV/0!"}},0.15788097514264363,2.0361187961108331E-2]
[{"$f":"runoff!A56","v":"08:40:00"},{"$f":"runoff!C56","v":{"$error":"#DIV/0!"}},{"$f":"runoff!$B$1","v":{"$error":"#DIV/0!"}},0.16095500796578463,2.097840758875286E-2]
[{"$f":"runoff!A57","v":"08:50:00"},{"$f":"runoff!C57","v":{"$error":"#DIV/0!"}},{"$f":"runoff!$B$1","v":{"$error":"#DIV/0!"}},0.16426417021164685,2.1601740878545658E-2]
[{"$f":"runoff!A58","v":"09:00:00"},{"$f":"runoff!C58","v":{"$error":"#DIV/0!"}},{"$f":"runoff!$B$1","v":{"$error":"#DIV/0!"}},0.16775790936059723,2.2328490965395218E-2]
[{"$f":"runoff!A59","v":"09:10:00"},{"$f":"runoff!C59","v":{"$error":"#DIV/0!"}},{"$f":"runoff!$B$1","v":{"$error":"#DIV/0!"}},0.17150019978533962,2.306321311432958E-2]
[{"$f":"runoff!A60","v":"09:20:00"},{"$f":"runoff!C60","v":{"$error":"#DIV/0!"}},{"$f":"runoff!$B$1","v":{"$error":"#DIV/0!"}},0.17556463381661469,2.3880513151241119E-2]
[{"$f":"runoff!A61","v":"09:30:00"},{"$f":"runoff!C61","v":{"$error":"#DIV/0!"}},{"$f":"runoff!$B$1","v":{"$error":"#DIV/0!"}},0.17998922746612336,2.4782867274823414E-2]
[{"$f":"runoff!A62","v":"09:40:00"},{"$f":"runoff!C62","v":{"$error":"#DIV/0!"}},{"$f":"runoff!$B$1","v":{"$error":"#DIV/0!"}},0.18479783587860163,2.5798481164806982E-2]
[{"$f":"runoff!A63","v":"09:50:00"},{"$f":"runoff!C63","v":{"$error":"#DIV/0!"}},{"$f":"runoff!$B$1","v":{"$error":"#DIV/0!"}},0.1900234250591242,2.6879408944060788E-2]
[{"$f":"runoff!A64","v":"10:00:00"},{"$f":"runoff!C64","v":{"$error":"#DIV/0!"}},{"$f":"runoff!$B$1","v":{"$error":"#DIV/0!"}},0.19578705343289193,2.8132729579442423E-2]
[{"$f":"runoff!A65","v":"10:10:00"},{"$f":"runoff!C65","v":{"$error":"#DIV/0!"}},{"$f":"runoff!$B$1","v":{"$error":"#DIV/0!"}},0.20218188200278675,2.9511808519118835E-2]
[{"$f":"runoff!A66","v":"10:20:00"},{"$f":"runoff!C66","v":{"$error":"#DIV/0!"}},{"$f":"runoff!$B$1","v":{"$error":"#DIV/0!"}},0.20929531873987817,3.1075745217183166E-2]
[{"$f":"runoff!A67","v":"10:30:00"},{"$f":"runoff!C67","v":{"$error":"#DIV/0!"}},{"$f":"runoff!$B$1","v":{"$error":"#DIV/0!"}},0.21737625630875845,3.2915556716909482E-2]
[{"$f":"runoff!A68","v":"10:40:00"},{"$f":"runoff!C68","v":{"$error":"#DIV/0!"}},{"$f":"runoff!$B$1","v":{"$error":"#DIV/0!"}},0.22662533750340935,3.5044767361346971E-2]
[{"$f":"runoff!A69","v":"10:50:00"},{"$f":"runoff!C69","v":{"$error":"#DIV/0!"}},{"$f":"runoff!$B$1","v":{"$error":"#DIV/0!"}},0.23731876063181603,3.7536149193771837E-2]
[{"$f":"runoff!A70","v":"11:00:00"},{"$f":"runoff!C70","v":{"$error":"#DIV/0!"}},{"$f":"runoff!$B$1","v":{"$error":"#DIV/0!"}},0.25042384255367423,3.9569506642202067E-2]
[{"$f":"runoff!A71","v":"11:10:00"},{"$f":"runoff!C71","v":{"$error":"#DIV/0!"}},{"$f":"runoff!$B$1","v":{"$error":"#DIV/0!"}},0.2681313257764889,4.0314279708366089E-2]
[{"$f":"runoff!A72","v":"11:20:00"},{"$f":"runoff!C72","v":{"$error":"#DIV/0!"}},{"$f":"runoff!$B$1","v":{"$error":"#DIV/0!"}},0.29285664151866603,4.1364202850250095E-2]
[{"$f":"runoff!A73","v":"11:30:00"},{"$f":"runoff!C73","v":{"$error":"#DIV/0!"}},{"$f":"runoff!$B$1","v":{"$error":"#DIV/0!"}},0.32761175058384995,4.2833060841851366E-2]
[{"$f":"runoff!A74","v":"11:40:00"},{"$f":"runoff!C74","v":{"$error":"#DIV/0!"}},{"$f":"runoff!$B$1","v":{"$error":"#DIV/0!"}},0.37837209295838925,4.5436197346646848E-2]
[{"$f":"runoff!A75","v":"11:50:00"},{"$f":"runoff!C75","v":{"$error":"#DIV/0!"}},{"$f":"runoff!$B$1","v":{"$error":"#DIV/0!"}},0.45932178582451305,5.1672801443418362E-2]
[{"$f":"runoff!A76","v":"12:00:00"},{"$f":"runoff!C76","v":{"$error":"#DIV/0!"}},{"$f":"runoff!$B$1","v":{"$error":"#DIV/0!"}},0.65964485580645593,6.4543880262372191E-2]
[{"$f":"runoff!A77","v":"12:10:00"},{"$f":"runoff!C77","v":{"$error":"#DIV/0!"}},{"$f":"runoff!$B$1","v":{"$error":"#DIV/0!"}},0.87471057009725184,7.5980405440903412E-2]
[{"$f":"runoff!A78","v":"12:20:00"},{"$f":"runoff!C78","v":{"$error":"#DIV/0!"}},{"$f":"runoff!$B$1","v":{"$error":"#DIV/0!"}},0.96334635362806653,8.0225396908997909E-2]
[{"$f":"runoff!A79","v":"12:30:00"},{"$f":"runoff!C79","v":{"$error":"#DIV/0!"}},{"$f":"runoff!$B$1","v":{"$error":"#DIV/0!"}},0.99387270712507225,8.1634170514156501E-2]
[{"$f":"runoff!A80","v":"12:40:00"},{"$f":"runoff!C80","v":{"$error":"#DIV/0!"}},{"$f":"runoff!$B$1","v":{"$error":"#DIV/0!"}},0.99974068280389561,8.190188218172631E-2]
[{"$f":"runoff!A81","v":"12:50:00"},{"$f":"runoff!C81","v":{"$error":"#DIV/0!"}},{"$f":"runoff!$B$1","v":{"$error":"#DIV/0!"}},0.9918063624780642,8.1539145190908546E-2]
[{"$f":"runoff!A82","v":"13:00:00"},{"$f":"runoff!C82","v":{"$error":"#DIV/0!"}},{"$f":"runoff!$B$1","v":{"$error":"#DIV/0!"}},0.97516141011041568,8.0774918272329826E-2]
[{"$f":"runoff!A83","v":"13:10:00"},{"$f":"runoff!C83","v":{"$error":"#DIV/0!"}},{"$f":"runoff!$B$1","v":{"$error":"#DIV/0!"}},0.95265946073361329,7.9729305377408521E-2]
[{"$f":"runoff!A84","v":"13:20:00"},{"$f":"runoff!C84","v":{"$error":"#DIV/0!"}},{"$f":"runoff!$B$1","v":{"$error":"#DIV/0!"}},0.92603056295813757,7.8466639802788979E-2]
[{"$f":"runoff!A85","v":"13:30:00"},{"$f":"runoff!C85","v":{"$error":"#DIV/0!"}},{"$f":"runoff!$B$1","v":{"$error":"#DIV/0!"}},0.89659831934703704,7.705322135459565E-2]
[{"$f":"runoff!A86","v":"13:40:00"},{"$f":"runoff!C86","v":{"$error":"#DIV/0!"}},{"$f":"runoff!$B$1","v":{"$error":"#DIV/0!"}},0.86529397261365915,7.5522863234389587E-2]
[{"$f":"runoff!A87","v":"13:50:00"},{"$f":"runoff!C87","v":{"$error":"#DIV/0!"}},{"$f":"runoff!$B$1","v":{"$error":"#DIV/0!"}},0.83268181260734486,7.3886816779291306E-2]
[{"$f":"runoff!A88","v":"14:00:00"},{"$f":"runoff!C88","v":{"$error":"#DIV/0!"}},{"$f":"runoff!$B$1","v":{"$error":"#DIV/0!"}},0.79930383667402671,7.2182131076231407E-2]
[{"$f":"runoff!A89","v":"14:10:00"},{"$f":"runoff!C89","v":{"$error":"#DIV/0!"}},{"$f":"runoff!$B$1","v":{"$error":"#DIV/0!"}},0.76556588029743367,7.0416774406387023E-2]
[{"$f":"runoff!A90","v":"14:20:00"},{"$f":"runoff!C90","v":{"$error":"#DIV/0!"}},{"$f":"runoff!$B$1","v":{"$error":"#DIV/0!"}},0.73175381011433283,6.8592710990331374E-2]
[{"$f":"runoff!A91","v":"14:30:00"},{"$f":"runoff!C91","v":{"$error":"#DIV/0!"}},{"$f":"runoff!$B$1","v":{"$error":"#DIV/0!"}},0.69813903580573577,6.6739300011628741E-2]
[{"$f":"runoff!A92","v":"14:40:00"},{"$f":"runoff!C92","v":{"$error":"#DIV/0!"}},{"$f":"runoff!$B$1","v":{"$error":"#DIV/0!"}},0.66486519329975824,6.4854025417989208E-2]
[{"$f":"runoff!A93","v":"14:50:00"},{"$f":"runoff!C93","v":{"$error":"#DIV/0!"}},{"$f":"runoff!$B$1","v":{"$error":"#DIV/0!"}},0.63219044169171512,6.2941269732771032E-2]
[{"$f":"runoff!A94","v":"15:00:00"},{"$f":"runoff!C94","v":{"$error":"#DIV/0!"}},{"$f":"runoff!$B$1","v":{"$error":"#DIV/0!"}},0.60024982548828154,6.1013398708001543E-2]
[{"$f":"runoff!A95","v":"15:10:00"},{"$f":"runoff!C95","v":{"$error":"#DIV/0!"}},{"$f":"runoff!$B$1","v":{"$error":"#DIV/0!"}},0.56905798037313116,5.9068932374824273E-2]
[{"$f":"runoff!A96","v":"15:20:00"},{"$f":"runoff!C96","v":{"$error":"#DIV/0!"}},{"$f":"runoff!$B$1","v":{"$error":"#DIV/0!"}},0.53873902148753783,5.7122145210627931E-2]
[{"$f":"runoff!A97","v":"15:30:00"},{"$f":"runoff!C97","v":{"$error":"#DIV/0!"}},{"$f":"runoff!$B$1","v":{"$error":"#DIV/0!"}},0.5094105891399533,5.5172791542471941E-2]
[{"$f":"runoff!A98","v":"15:40:00"},{"$f":"runoff!C98","v":{"$error":"#DIV/0!"}},{"$f":"runoff!$B$1","v":{"$error":"#DIV/0!"}},0.48118661258484169,5.3229157660269963E-2]
[{"$f":"runoff!A99","v":"15:50:00"},{"$f":"runoff!C99","v":{"$error":"#DIV/0!"}},{"$f":"runoff!$B$1","v":{"$error":"#DIV/0!"}},0.45406151191189659,5.1291893797777648E-2]
[{"$f":"runoff!A100","v":"16:00:00"},{"$f":"runoff!C100","v":{"$error":"#DIV/0!"}},{"$f":"runoff!$B$1","v":{"$error":"#DIV/0!"}},0.4280333254419173,4.9352510220510834E-2]
[{"$f":"runoff!A101","v":"16:10:00"},{"$f":"runoff!C101","v":{"$error":"#DIV/0!"}},{"$f":"runoff!$B$1","v":{"$error":"#DIV/0!"}},0.4032061998562767,4.7439595215043609E-2]
[{"$f":"runoff!A102","v":"16:20:00"},{"$f":"runoff!C102","v":{"$error":"#DIV/0!"}},{"$f":"runoff!$B$1","v":{"$error":"#DIV/0!"}},0.3796695483048465,4.5556483146388597E-2]
[{"$f":"runoff!A103","v":"16:30:00"},{"$f":"runoff!C103","v":{"$error":"#DIV/0!"}},{"$f":"runoff!$B$1","v":{"$error":"#DIV/0!"}},0.35710438991921106,4.4084693355821464E-2]
[{"$f":"runoff!A104","v":"16:40:00"},{"$f":"runoff!C104","v":{"$error":"#DIV/0!"}},{"$f":"runoff!$B$1","v":{"$error":"#DIV/0!"}},0.33507127282123972,4.3153727023116435E-2]
[{"$f":"runoff!A105","v":"16:50:00"},{"$f":"runoff!C105","v":{"$error":"#DIV/0!"}},{"$f":"runoff!$B$1","v":{"$error":"#DIV/0!"}},0.31354180704235302,4.2243448831138182E-2]
[{"$f":"runoff!A106","v":"17:00:00"},{"$f":"runoff!C106","v":{"$error":"#DIV/0!"}},{"$f":"runoff!$B$1","v":{"$error":"#DIV/0!"}},0.29249928293042543,4.1348686744705015E-2]
[{"$f":"runoff!A107","v":"17:10:00"},{"$f":"runoff!C107","v":{"$error":"#DIV/0!"}},{"$f":"runoff!$B$1","v":{"$error":"#DIV/0!"}},0.27181399331110756,4.0469440763816929E-2]
[{"$f":"runoff!A108","v":"17:20:00"},{"$f":"runoff!C108","v":{"$error":"#DIV/0!"}},{"$f":"runoff!$B$1","v":{"$error":"#DIV/0!"}},0.2514692285322741,3.9610882923655624E-2]
[{"$f":"runoff!A109","v":"17:30:00"},{"$f":"runoff!C109","v":{"$error":"#DIV/0!"}},{"$f":"runoff!$B$1","v":{"$error":"#DIV/0!"}},0.23263761411656092,3.6440948310389548E-2]
[{"$f":"runoff!A110","v":"17:40:00"},{"$f":"runoff!C110","v":{"$error":"#DIV/0!"}},{"$f":"runoff!$B$1","v":{"$error":"#DIV/0!"}},0.21663947255516641,3.2721691739298606E-2]
[{"$f":"runoff!A111","v":"17:50:00"},{"$f":"runoff!C111","v":{"$error":"#DIV/0!"}},{"$f":"runoff!$B$1","v":{"$error":"#DIV/0!"}},0.20336967847004583,2.977952877846261E-2]
[{"$f":"runoff!A112","v":"18:00:00"},{"$f":"runoff!C112","v":{"$error":"#DIV/0!"}},{"$f":"runoff!$B$1","v":{"$error":"#DIV/0!"}},0.19232559846920813,2.7399311223352422E-2]
[{"$f":"runoff!A113","v":"18:10:00"},{"$f":"runoff!C113","v":{"$error":"#DIV/0!"}},{"$f":"runoff!$B$1","v":{"$error":"#DIV/0!"}},0.18305292985494281,2.5441470774222392E-2]
[{"$f":"runoff!A114","v":"18:20:00"},{"$f":"runoff!C114","v":{"$error":"#DIV/0!"}},{"$f":"runoff!$B$1","v":{"$error":"#DIV/0!"}},0.17510412398375022,2.3780941946694934E-2]
[{"$f":"runoff!A115","v":"18:30:00"},{"$f":"runoff!C115","v":{"$error":"#DIV/0!"}},{"$f":"runoff!$B$1","v":{"$error":"#DIV/0!"}},0.16821217883694711,2.2401605871378499E-2]
[{"$f":"runoff!A116","v":"18:40:00"},{"$f":"runoff!C116","v":{"$error":"#DIV/0!"}},{"$f":"runoff!$B$1","v":{"$error":"#DIV/0!"}},0.16226156864555027,2.1241382876647973E-2]
[{"$f":"runoff!A117","v":"18:50:00"},{"$f":"runoff!C117","v":{"$error":"#DIV/0!"}},{"$f":"runoff!$B$1","v":{"$error":"#DIV/0!"}},0.15708725625787245,2.021962729665398E-2]
[{"$f":"runoff!A118","v":"19:00:00"},{"$f":"runoff!C118","v":{"$error":"#DIV/0!"}},{"$f":"runoff!$B$1","v":{"$error":"#DIV/0!"}},0.15255328248047445,1.9353982554375038E-2]
[{"$f":"runoff!A119","v":"19:10:00"},{"$f":"runoff!C119","v":{"$error":"#DIV/0!"}},{"$f":"runoff!$B$1","v":{"$error":"#DIV/0!"}},0.14853945406360816,1.8592645682168576E-2]
[{"$f":"runoff!A120","v":"19:20:00"},{"$f":"runoff!C120","v":{"$error":"#DIV/0!"}},{"$f":"runoff!$B$1","v":{"$error":"#DIV/0!"}},0.14495113211133781,1.7932051881083891E-2]
[{"$f":"runoff!A121","v":"19:30:00"},{"$f":"runoff!C121","v":{"$error":"#DIV/0!"}},{"$f":"runoff!$B$1","v":{"$error":"#DIV/0!"}},0.14171746880790961,1.732421860967719E-2]
[{"$f":"runoff!A122","v":"19:40:00"},{"$f":"runoff!C122","v":{"$error":"#DIV/0!"}},{"$f":"runoff!$B$1","v":{"$error":"#DIV/0!"}},0.13878022052973635,1.6789819326364887E-2]
[{"$f":"runoff!A123","v":"19:50:00"},{"$f":"runoff!C123","v":{"$error":"#DIV/0!"}},{"$f":"runoff!$B$1","v":{"$error":"#DIV/0!"}},0.13618792523276038,1.6326820483749702E-2]
[{"$f":"runoff!A124","v":"20:00:00"},{"$f":"runoff!C124","v":{"$error":"#DIV/0!"}},{"$f":"runoff!$B$1","v":{"$error":"#DIV/0!"}},0.13388555339793365,1.5911651825041565E-2]
[{"$f":"runoff!A125","v":"20:10:00"},{"$f":"runoff!C125","v":{"$error":"#DIV/0!"}},{"$f":"runoff!$B$1","v":{"$error":"#DIV/0!"}},0.13172403596935056,1.5521635936888453E-2]
[{"$f":"runoff!A126","v":"20:20:00"},{"$f":"runoff!C126","v":{"$error":"#DIV/0!"}},{"$f":"runoff!$B$1","v":{"$error":"#DIV/0!"}},0.12968039082066146,1.5156261885271336E-2]
[{"$f":"runoff!A127","v":"20:30:00"},{"$f":"runoff!C127","v":{"$error":"#DIV/0!"}},{"$f":"runoff!$B$1","v":{"$error":"#DIV/0!"}},0.12783767402195903,1.4836291178583859E-2]
[{"$f":"runoff!A128","v":"20:40:00"},{"$f":"runoff!C128","v":{"$error":"#DIV/0!"}},{"$f":"runoff!$B$1","v":{"$error":"#DIV/0!"}},0.12615438728663966,1.4560830081274793E-2]
[{"$f":"runoff!A129","v":"20:50:00"},{"$f":"runoff!C129","v":{"$error":"#DIV/0!"}},{"$f":"runoff!$B$1","v":{"$error":"#DIV/0!"}},0.12450349163690377,1.4266110493152975E-2]
[{"$f":"runoff!A130","v":"21:00:00"},{"$f":"runoff!C130","v":{"$error":"#DIV/0!"}},{"$f":"runoff!$B$1","v":{"$error":"#DIV/0!"}},0.12298908794038263,1.4015097515976177E-2]
[{"$f":"runoff!A131","v":"21:10:00"},{"$f":"runoff!C131","v":{"$error":"#DIV/0!"}},{"$f":"runoff!$B$1","v":{"$error":"#DIV/0!"}},0.12159031635516916,1.3765574251986325E-2]
[{"$f":"runoff!A132","v":"21:20:00"},{"$f":"runoff!C132","v":{"$error":"#DIV/0!"}},{"$f":"runoff!$B$1","v":{"$error":"#DIV/0!"}},0.12019041301633916,1.3517549648812032E-2]
[{"$f":"runoff!A133","v":"21:30:00"},{"$f":"runoff!C133","v":{"$error":"#DIV/0!"}},{"$f":"runoff!$B$1","v":{"$error":"#DIV/0!"}},0.11888446062865754,1.331201385783148E-2]
[{"$f":"runoff!A134","v":"21:40:00"},{"$f":"runoff!C134","v":{"$error":"#DIV/0!"}},{"$f":"runoff!$B$1","v":{"$error":"#DIV/0!"}},0.1176523632378208,1.310753048898149E-2]
[{"$f":"runoff!A135","v":"21:50:00"},{"$f":"runoff!C135","v":{"$error":"#DIV/0!"}},{"$f":"runoff!$B$1","v":{"$error":"#DIV/0!"}},0.11649314686431618,1.2904104986945204E-2]
[{"$f":"runoff!A136","v":"22:00:00"},{"$f":"runoff!C136","v":{"$error":"#DIV/0!"}},{"$f":"runoff!$B$1","v":{"$error":"#DIV/0!"}},0.11538719227217019,1.2742129962704454E-2]
[{"$f":"runoff!A137","v":"22:10:00"},{"$f":"runoff!C137","v":{"$error":"#DIV/0!"}},{"$f":"runoff!$B$1","v":{"$error":"#DIV/0!"}},0.11433361415913669,1.2540622615534788E-2]
[{"$f":"runoff!A138","v":"22:20:00"},{"$f":"runoff!C138","v":{"$error":"#DIV/0!"}},{"$f":"runoff!$B$1","v":{"$error":"#DIV/0!"}},0.11333170090526593,1.2380189434518539E-2]
[{"$f":"runoff!A139","v":"22:30:00"},{"$f":"runoff!C139","v":{"$error":"#DIV/0!"}},{"$f":"runoff!$B$1","v":{"$error":"#DIV/0!"}},0.1123621767228636,1.2220446294019837E-2]
[{"$f":"runoff!A140","v":"22:40:00"},{"$f":"runoff!C140","v":{"$error":"#DIV/0!"}},{"$f":"runoff!$B$1","v":{"$error":"#DIV/0!"}},0.11142440326972652,1.206139618777716E-2]
[{"$f":"runoff!A141","v":"22:50:00"},{"$f":"runoff!C141","v":{"$error":"#DIV/0!"}},{"$f":"runoff!$B$1","v":{"$error":"#DIV/0!"}},0.11049949799772643,1.194256523488973E-2]
[{"$f":"runoff!A142","v":"23:00:00"},{"$f":"runoff!C142","v":{"$error":"#DIV/0!"}},{"$f":"runoff!$B$1","v":{"$error":"#DIV/0!"}},0.10958689776885701,1.1784735260993974E-2]
[{"$f":"runoff!A143","v":"23:10:00"},{"$f":"runoff!C143","v":{"$error":"#DIV/0!"}},{"$f":"runoff!$B$1","v":{"$error":"#DIV/0!"}},0.10870427837481277,1.1627606759435244E-2]
[{"$f":"runoff!A144","v":"23:20:00"},{"$f":"runoff!C144","v":{"$error":"#DIV/0!"}},{"$f":"runoff!$B$1","v":{"$error":"#DIV/0!"}},0.10783297250958594,1.1510222615222878E-2]
[{"$f":"runoff!A145","v":"23:30:00"},{"$f":"runoff!C145","v":{"$error":"#DIV/0!"}},{"$f":"runoff!$B$1","v":{"$error":"#DIV/0!"}},0.10697241009399024,1.1354329285234445E-2]
[{"$f":"runoff!A146","v":"23:40:00"},{"$f":"runoff!C146","v":{"$error":"#DIV/0!"}},{"$f":"runoff!$B$1","v":{"$error":"#DIV/0!"}},0.10612216187189825,1.1237875195964841E-2]
[{"$f":"runoff!A147","v":"23:50:00"},{"$f":"runoff!C147","v":{"$error":"#DIV/0!"}},{"$f":"runoff!$B$1","v":{"$error":"#DIV/0!"}},0.10528165321103088,1.1083226902581154E-2]
[{"$f":"runoff!A148","v":1},{"$f":"runoff!C148","v":{"$error":"#DIV/0!"}},{"$f":"runoff!$B$1","v":{"$error":"#DIV/0!"}},0.10456583601468644,1.0967710356165106E-2]

{"sheet":"浸透計算","index":17,"n_rows":149,"n_cols":7,"rows_kept":149,"cut":false,"hidden":true,"merged":[]}
[8,9,10]
[null,{"$f":"MAX(B5:B149)","v":0.38900000000000001},{"$f":"MAX(C5:C149)","v":0.38500299999999998}]
[]
["時刻","浸透考慮前","浸透考慮後","許容放流量"]
["00:00:00",0,0,{"$f":"事前相談チェックシート!U25","v":99999},null,null,0]
["00:10:00",1.025E-2,6.2529999999999999E-3,{"$f":"D5","v":99999},null,null,{"$f":"G5+1/6","v":0.16666666666666666}]
["00:20:00",1.025E-2,6.2529999999999999E-3,{"$f":"D6","v":99999},null,null,{"$f":"G6+1/6","v":0.33333333333333331}]
["00:30:00",1.0500000000000001E-2,6.5030000000000001E-3,99999,null,null,0.5]
["00:40:00",1.0500000000000001E-2,6.5030000000000001E-3,99999,null,null,0.66666666666666663]
["00:50:00",1.0749999999999999E-2,6.7530000000000003E-3,99999,null,null,0.83333333333333326]
["01:00:00",1.0749999999999999E-2,6.7530000000000003E-3,99999,null,null,0.99999999999999989]
["01:10:00",1.0749999999999999E-2,6.7530000000000003E-3,99999,null,null,1.1666666666666665]
["01:20:00",1.0999999999999999E-2,7.0029999999999997E-3,99999,null,null,1.3333333333333333]
["01:30:00",1.0999999999999999E-2,7.0029999999999997E-3,99999,null,null,1.5]
["01:40:00",1.125E-2,7.2529999999999999E-3,99999,null,null,1.6666666666666667]
["01:50:00",1.125E-2,7.2529999999999999E-3,99999,null,null,1.8333333333333335]
["02:00:00",1.15E-2,7.5030000000000001E-3,99999,null,null,2]
["02:10:00",1.15E-2,7.5030000000000001E-3,99999,null,null,2.1666666666666665]
["02:20:00",1.175E-2,7.7530000000000003E-3,99999,null,null,2.333333333333333]
["02:30:00",1.2E-2,8.0029999999999997E-3,99999,null,null,2.4999999999999996]
["02:40:00",1.2E-2,8.0029999999999997E-3,99999,null,null,2.6666666666666661]
["02:50:00",1.225E-2,8.2529999999999999E-3,99999,null,null,2.8333333333333326]
["03:00:00",1.225E-2,8.2529999999999999E-3,99999,null,null,2.9999999999999991]
["03:10:00",1.2500000000000001E-2,8.5030000000000001E-3,99999,null,null,3.1666666666666656]
["03:20:00",1.2749999999999999E-2,8.7530000000000004E-3,99999,null,null,3.3333333333333321]
["03:30:00",1.2749999999999999E-2,8.7530000000000004E-3,99999,null,null,3.4999999999999987]
["03:40:00",1.2999999999999999E-2,9.0030000000000006E-3,99999,null,null,3.6666666666666652]
["03:50:00",1.325E-2,9.2530000000000008E-3,99999,null,null,3.8333333333333317]
["04:00:00",1.325E-2,9.2530000000000008E-3,99999,null,null,3.9999999999999982]
["04:10:00",1.35E-2,9.5029999999999993E-3,99999,null,null,4.1666666666666652]
["04:20:00",1.375E-2,9.7529999999999995E-3,99999,null,null,4.3333333333333321]
["04:30:00",1.4E-2,1.0003E-2,99999,null,null,4.4999999999999991]
["04:40:00",1.4250000000000001E-2,1.0253E-2,99999,null,null,4.6666666666666661]
["04:50:00",1.4500000000000001E-2,1.0503E-2,99999,null,null,4.833333333333333]
["05:00:00",1.4749999999999999E-2,1.0753E-2,99999,null,null,5]
["05:10:00",1.4999999999999999E-2,1.1003000000000001E-2,99999,null,null,5.166666666666667]
["05:20:00",1.525E-2,1.1253000000000001E-2,99999,null,null,5.3333333333333339]
["05:30:00",1.55E-2,1.1502999999999999E-2,99999,null,null,5.5000000000000009]
["05:40:00",1.575E-2,1.1753E-2,99999,null,null,5.6666666666666679]
["05:50:00",1.6E-2,1.2003E-2,99999,null,null,5.8333333333333348]
["06:00:00",1.6250000000000001E-2,1.2253E-2,99999,null,null,6.0000000000000018]
["06:10:00",1.6500000000000001E-2,1.2503E-2,99999,null,null,6.1666666666666687]
["06:20:00",1.7000000000000001E-2,1.3003000000000001E-2,99999,null,null,6.3333333333333357]
["06:30:00",1.7250000000000001E-2,1.3252999999999999E-2,99999,null,null,6.5000000000000027]
["06:40:00",1.7749999999999998E-2,1.3753E-2,99999,null,null,6.6666666666666696]
["06:50:00",1.7999999999999999E-2,1.4003E-2,99999,null,null,6.8333333333333366]
["07:00:00",1.8499999999999999E-2,1.4503E-2,99999,null,null,7.0000000000000036]
["07:10:00",1.9E-2,1.5003000000000001E-2,99999,null,null,7.1666666666666705]
["07:20:00",1.925E-2,1.5252999999999999E-2,99999,null,null,7.3333333333333375]
["07:30:00",1.975E-2,1.5753E-2,99999,null,null,7.5000000000000044]
["07:40:00",2.0500000000000001E-2,1.6503E-2,99999,null,null,7.6666666666666714]
["07:50:00",2.1000000000000001E-2,1.7003000000000001E-2,99999,null,null,7.8333333333333384]
["08:00:00",2.1499999999999998E-2,1.7503000000000001E-2,99999,null,null,8.0000000000000053]
["08:10:00",2.2249999999999999E-2,1.8252999999999998E-2,99999,null,null,8.1666666666666714]
["08:20:00",2.2749999999999999E-2,1.8752999999999999E-2,99999,null,null,8.3333333333333375]
["08:30:00",2.35E-2,1.9503E-2,99999,null,null,8.5000000000000036]
["08:40:00",2.4500000000000001E-2,2.0503E-2,99999,null,null,8.6666666666666696]
["08:50:00",2.5250000000000002E-2,2.1253000000000001E-2,99999,null,null,8.8333333333333357]
["09:00:00",2.6249999999999999E-2,2.2252999999999998E-2,99999,null,null,9.0000000000000018]
["09:10:00",2.725E-2,2.3252999999999999E-2,99999,null,null,9.1666666666666679]
["09:20:00",2.8500000000000001E-2,2.4503E-2,99999,null,null,9.3333333333333339]
["09:30:00",2.9749999999999999E-2,2.5753000000000002E-2,99999,null,null,9.5]
["09:40:00",3.125E-2,2.7252999999999999E-2,99999,null,null,9.6666666666666661]
["09:50:00",3.2750000000000001E-2,2.8753000000000001E-2,99999,null,null,9.8333333333333321]
["10:00:00",3.4750000000000003E-2,3.0752999999999999E-2,99999,null,null,9.9999999999999982]
["10:10:00",3.6749999999999998E-2,3.2752999999999997E-2,99999,null,null,10.166666666666664]
["10:20:00",3.925E-2,3.5253E-2,99999,null,null,10.33333333333333]
["10:30:00",4.2250000000000003E-2,3.8253000000000002E-2,99999,null,null,10.499999999999996]
["10:40:00",4.5749999999999999E-2,4.1752999999999998E-2,99999,null,null,10.666666666666663]
["10:50:00",0.05,4.6003000000000002E-2,99999,null,null,10.833333333333329]
["11:00:00",5.5500000000000001E-2,5.1503E-2,{"$f":"D70","v":99999},null,null,{"$f":"G70+1/6","v":10.999999999999995}]
["11:10:00",6.275E-2,5.8753E-2,99999,null,null,11.166666666666661]
["11:20:00",7.2499999999999995E-2,6.8502999999999994E-2,99999,null,null,11.333333333333327]
["11:30:00",8.6999999999999994E-2,8.3002999999999993E-2,99999,null,null,11.499999999999993]
["11:40:00",0.11125,0.107253,99999,null,null,11.666666666666659]
["11:50:00",0.16125,0.157253,99999,null,null,11.833333333333325]
["12:00:00",0.38900000000000001,0.38500299999999998,99999,null,null,11.999999999999991]
["12:10:00",0.2175,0.213503,99999,null,null,12.166666666666657]
["12:20:00",0.13075000000000001,0.126753,99999,null,null,12.333333333333323]
["12:30:00",9.7250000000000003E-2,9.3253000000000003E-2,99999,null,null,12.499999999999989]
["12:40:00",7.9000000000000001E-2,7.5003E-2,99999,null,null,12.666666666666655]
["12:50:00",6.7250000000000004E-2,6.3253000000000004E-2,99999,null,null,12.833333333333321]
["13:00:00",5.8999999999999997E-2,5.5003000000000003E-2,99999,null,null,12.999999999999988]
["13:10:00",5.2749999999999998E-2,4.8752999999999998E-2,99999,null,null,13.166666666666654]
["13:20:00",4.7750000000000001E-2,4.3753E-2,99999,null,null,13.33333333333332]
["13:30:00",4.3999999999999997E-2,4.0002999999999997E-2,99999,null,null,13.499999999999986]
["13:40:00",4.0750000000000001E-2,3.6753000000000001E-2,99999,null,null,13.666666666666652]
["13:50:00",3.7999999999999999E-2,3.4002999999999999E-2,99999,null,null,13.833333333333318]
["14:00:00",3.5749999999999997E-2,3.1753000000000003E-2,99999,null,null,13.999999999999984]
["14:10:00",3.3750000000000002E-2,2.9753000000000002E-2,99999,null,null,14.16666666666665]
["14:20:00",3.2000000000000001E-2,2.8003E-2,99999,null,null,14.333333333333316]
["14:30:00",3.0499999999999999E-2,2.6502999999999999E-2,99999,null,null,14.499999999999982]
["14:40:00",2.9000000000000001E-2,2.5003000000000001E-2,99999,null,null,14.666666666666648]
["14:50:00",2.8000000000000001E-2,2.4003E-2,99999,null,null,14.833333333333314]
["15:00:00",2.6749999999999999E-2,2.2752999999999999E-2,99999,null,null,14.99999999999998]
["15:10:00",2.5749999999999999E-2,2.1753000000000002E-2,99999,null,null,15.166666666666647]
["15:20:00",2.4750000000000001E-2,2.0753000000000001E-2,99999,null,null,15.333333333333313]
["15:30:00",2.4E-2,2.0003E-2,99999,null,null,15.499999999999979]
["15:40:00",2.325E-2,1.9252999999999999E-2,99999,null,null,15.666666666666645]
["15:50:00",2.2499999999999999E-2,1.8502999999999999E-2,99999,null,null,15.833333333333311]
["16:00:00",2.1749999999999999E-2,1.7753000000000001E-2,99999,null,null,15.999999999999977]
["16:10:00",2.1250000000000002E-2,1.7253000000000001E-2,99999,null,null,16.166666666666643]
["16:20:00",2.0750000000000001E-2,1.6753000000000001E-2,99999,null,null,16.333333333333311]
["16:30:00",0.02,1.6003E-2,99999,null,null,16.499999999999979]
["16:40:00",1.95E-2,1.5502999999999999E-2,99999,null,null,16.666666666666647]
["16:50:00",1.925E-2,1.5252999999999999E-2,99999,null,null,16.833333333333314]
["17:00:00",1.8749999999999999E-2,1.4753E-2,99999,null,null,16.999999999999982]
["17:10:00",1.8249999999999999E-2,1.4253E-2,99999,null,null,17.16666666666665]
["17:20:00",1.7749999999999998E-2,1.3753E-2,99999,null,null,17.333333333333318]
["17:30:00",1.7500000000000002E-2,1.3502999999999999E-2,99999,null,null,17.499999999999986]
["17:40:00",1.7000000000000001E-2,1.3003000000000001E-2,99999,null,null,17.666666666666654]
["17:50:00",1.6750000000000001E-2,1.2753E-2,99999,null,null,17.833333333333321]
["18:00:00",1.6500000000000001E-2,1.2503E-2,99999,null,null,17.999999999999989]
["18:10:00",1.6250000000000001E-2,1.2253E-2,99999,null,null,18.166666666666657]
["18:20:00",1.575E-2,1.1753E-2,99999,null,null,18.333333333333325]
["18:30:00",1.55E-2,1.1502999999999999E-2,99999,null,null,18.499999999999993]
["18:40:00",1.525E-2,1.1253000000000001E-2,99999,null,null,18.666666666666661]
["18:50:00",1.4999999999999999E-2,1.1003000000000001E-2,99999,null,null,18.833333333333329]
["19:00:00",1.4749999999999999E-2,1.0753E-2,99999,null,null,18.999999999999996]
["19:10:00",1.4500000000000001E-2,1.0503E-2,99999,null,null,19.166666666666664]
["19:20:00",1.4250000000000001E-2,1.0253E-2,99999,null,null,19.333333333333332]
["19:30:00",1.4E-2,1.0003E-2,99999,null,null,19.5]
["19:40:00",1.375E-2,9.7529999999999995E-3,99999,null,null,19.666666666666668]
["19:50:00",1.375E-2,9.7529999999999995E-3,99999,null,null,19.833333333333336]
["20:00:00",1.35E-2,9.5029999999999993E-3,99999,null,null,20.000000000000004]
["20:10:00",1.325E-2,9.2530000000000008E-3,99999,null,null,20.166666666666671]
["20:20:00",1.2999999999999999E-2,9.0030000000000006E-3,99999,null,null,20.333333333333339]
["20:30:00",1.2999999999999999E-2,9.0030000000000006E-3,99999,null,null,20.500000000000007]
["20:40:00",1.2749999999999999E-2,8.7530000000000004E-3,99999,null,null,20.666666666666675]
["20:50:00",1.2500000000000001E-2,8.5030000000000001E-3,99999,null,null,20.833333333333343]
["21:00:00",1.2500000000000001E-2,8.5030000000000001E-3,99999,null,null,21.000000000000011]
["21:10:00",1.225E-2,8.2529999999999999E-3,99999,null,null,21.166666666666679]
["21:20:00",1.2E-2,8.0029999999999997E-3,99999,null,null,21.333333333333346]
["21:30:00",1.2E-2,8.0029999999999997E-3,99999,null,null,21.500000000000014]
["21:40:00",1.175E-2,7.7530000000000003E-3,{"$f":"D134","v":99999},null,null,{"$f":"G134+1/6","v":21.666666666666682}]
["21:50:00",1.175E-2,7.7530000000000003E-3,99999,null,null,21.83333333333335]
["22:00:00",1.15E-2,7.5030000000000001E-3,99999,null,null,22.000000000000018]
["22:10:00",1.15E-2,7.5030000000000001E-3,99999,null,null,22.166666666666686]
["22:20:00",1.125E-2,7.2529999999999999E-3,99999,null,null,22.333333333333353]
["22:30:00",1.125E-2,7.2529999999999999E-3,99999,null,null,22.500000000000021]
["22:40:00",1.0999999999999999E-2,7.0029999999999997E-3,99999,null,null,22.666666666666689]
["22:50:00",1.0999999999999999E-2,7.0029999999999997E-3,99999,null,null,22.833333333333357]
["23:00:00",1.0749999999999999E-2,6.7530000000000003E-3,99999,null,null,23.000000000000025]
["23:10:00",1.0749999999999999E-2,6.7530000000000003E-3,99999,null,null,23.166666666666693]
["23:20:00",1.0500000000000001E-2,6.5030000000000001E-3,99999,null,null,23.333333333333361]
["23:30:00",1.0500000000000001E-2,6.5030000000000001E-3,99999,null,null,23.500000000000028]
["23:40:00",1.025E-2,6.2529999999999999E-3,99999,null,null,23.666666666666696]
["23:50:00",1.025E-2,6.2529999999999999E-3,99999,null,null,23.833333333333364]
[1,1.025E-2,6.2529999999999999E-3,99999,null,null,24.000000000000032]

{"sheet":"逐次計算（浸透考慮）","index":18,"n_rows":148,"n_cols":8,"rows_kept":148,"cut":false,"hidden":true,"merged":[]}
["時刻","行為後流入量","許容放流量","調整池水位","調節後放流量"]
[null,null,null,null,{"$f":"MAX(E3:E147)","v":8.1879606307847672E-2}]
[{"$f":"runoff!A4","v":"00:00:00"},{"$f":"浸透計算!C5","v":0},{"$f":"runoff!$B$1","v":{"$error":"#DIV/0!"}},0,0,null,null,0]
[{"$f":"runoff!A5","v":"00:10:00"},{"$f":"浸透計算!C6","v":6.2529999999999999E-3},{"$f":"runoff!$B$1","v":{"$error":"#DIV/0!"}},0,0,null,null,{"$f":"H3+1/6","v":0.16666666666666666}]
[{"$f":"runoff!A6","v":"00:20:00"},{"$f":"浸透計算!C7","v":6.2529999999999999E-3},{"$f":"runoff!$B$1","v":{"$error":"#DIV/0!"}},3.048323936444922E-3,5.4741329228658912E-5,null,null,{"$f":"H4+1/6","v":0.33333333333333331}]
[{"$f":"runoff!A7","v":"00:30:00"},{"$f":"浸透計算!C8","v":6.5030000000000001E-3},{"$f":"runoff!$B$1","v":{"$error":"#DIV/0!"}},9.0347916056823779E-3,2.7877440998851343E-4,null,null,0.5]
[{"$f":"runoff!A8","v":"00:40:00"},{"$f":"浸透計算!C9","v":6.5030000000000001E-3},{"$f":"runoff!$B$1","v":{"$error":"#DIV/0!"}},1.4880905942718591E-2,5.9012643803785291E-4,null,null,0.66666666666666663]
[{"$f":"runoff!A9","v":"00:50:00"},{"$f":"浸透計算!C10","v":6.7530000000000003E-3},{"$f":"runoff!$B$1","v":{"$error":"#DIV/0!"}},2.0518086415685088E-2,9.5360660026360127E-4,null,null,0.83333333333333326]
[{"$f":"runoff!A10","v":"01:00:00"},{"$f":"浸透計算!C11","v":6.7530000000000003E-3},{"$f":"runoff!$B$1","v":{"$error":"#DIV/0!"}},2.590362924313927E-2,1.35178965057957E-3,null,null,0.99999999999999989]
[{"$f":"runoff!A11","v":"01:10:00"},{"$f":"浸透計算!C12","v":6.7530000000000003E-3},{"$f":"runoff!$B$1","v":{"$error":"#DIV/0!"}},3.1009248604155857E-2,1.7727843153533718E-3,null,null,1.1666666666666665]
[{"$f":"runoff!A12","v":"01:20:00"},{"$f":"浸透計算!C13","v":7.0029999999999997E-3},{"$f":"runoff!$B$1","v":{"$error":"#DIV/0!"}},3.5705022699998826E-2,2.1851416897659195E-3,null,null,1.3333333333333333]
[{"$f":"runoff!A13","v":"01:30:00"},{"$f":"浸透計算!C14","v":7.0029999999999997E-3},{"$f":"runoff!$B$1","v":{"$error":"#DIV/0!"}},4.0116205323306446E-2,2.6014536428419196E-3,null,null,1.5]
[{"$f":"runoff!A14","v":"01:40:00"},{"$f":"浸透計算!C15","v":7.2529999999999999E-3},{"$f":"runoff!$B$1","v":{"$error":"#DIV/0!"}},4.4241594082623271E-2,3.0162558798805437E-3,null,null,1.6666666666666667]
[{"$f":"runoff!A15","v":"01:50:00"},{"$f":"浸透計算!C16","v":7.2529999999999999E-3},{"$f":"runoff!$B$1","v":{"$error":"#DIV/0!"}},4.8084953205836584E-2,3.4249139029190528E-3,null,null,1.8333333333333335]
[{"$f":"runoff!A16","v":"02:00:00"},{"$f":"浸透計算!C17","v":7.5030000000000001E-3},{"$f":"runoff!$B$1","v":{"$error":"#DIV/0!"}},5.1660936444871415E-2,3.8099201777101318E-3,null,null,2]
[{"$f":"runoff!A17","v":"02:10:00"},{"$f":"浸透計算!C18","v":7.5030000000000001E-3},{"$f":"runoff!$B$1","v":{"$error":"#DIV/0!"}},5.4981433322434145E-2,4.1944028379123097E-3,null,null,2.1666666666666665]
[{"$f":"runoff!A18","v":"02:20:00"},{"$f":"浸透計算!C19","v":7.7530000000000003E-3},{"$f":"runoff!$B$1","v":{"$error":"#DIV/0!"}},5.8068959867372288E-2,4.5336265207134565E-3,null,null,2.333333333333333]
[{"$f":"runoff!A19","v":"02:30:00"},{"$f":"浸透計算!C20","v":8.0029999999999997E-3},{"$f":"runoff!$B$1","v":{"$error":"#DIV/0!"}},6.0941504837449784E-2,4.8815320401289653E-3,null,null,2.4999999999999996]
[{"$f":"runoff!A20","v":"02:40:00"},{"$f":"浸透計算!C21","v":8.0029999999999997E-3},{"$f":"runoff!$B$1","v":{"$error":"#DIV/0!"}},6.3720968218851523E-2,5.2228924176875085E-3,null,null,2.6666666666666661]
[{"$f":"runoff!A21","v":"02:50:00"},{"$f":"浸透計算!C22","v":8.2529999999999999E-3},{"$f":"runoff!$B$1","v":{"$error":"#DIV/0!"}},6.6298947744808823E-2,5.5412158795326311E-3,null,null,2.8333333333333326]
[{"$f":"runoff!A22","v":"03:00:00"},{"$f":"浸透計算!C23","v":8.2529999999999999E-3},{"$f":"runoff!$B$1","v":{"$error":"#DIV/0!"}},6.869138468446595E-2,5.8501623431645288E-3,null,null,2.9999999999999991]
[{"$f":"runoff!A23","v":"03:10:00"},{"$f":"浸透計算!C24","v":8.5030000000000001E-3},{"$f":"runoff!$B$1","v":{"$error":"#DIV/0!"}},7.091575496679052E-2,6.132951416108849E-3,null,null,3.1666666666666656]
[{"$f":"runoff!A24","v":"03:20:00"},{"$f":"浸透計算!C25","v":8.7530000000000004E-3},{"$f":"runoff!$B$1","v":{"$error":"#DIV/0!"}},7.2990654987521025E-2,6.4040852084058034E-3,null,null,3.3333333333333321]
[{"$f":"runoff!A25","v":"03:30:00"},{"$f":"浸透計算!C26","v":8.7530000000000004E-3},{"$f":"runoff!$B$1","v":{"$error":"#DIV/0!"}},7.5050867036684121E-2,6.6628169582958882E-3,null,null,3.4999999999999987]
[{"$f":"runoff!A26","v":"03:40:00"},{"$f":"浸透計算!C27","v":9.0030000000000006E-3},{"$f":"runoff!$B$1","v":{"$error":"#DIV/0!"}},7.6977870752390085E-2,6.9249421531020023E-3,null,null,3.6666666666666652]
[{"$f":"runoff!A27","v":"03:50:00"},{"$f":"浸透計算!C28","v":9.2530000000000008E-3},{"$f":"runoff!$B$1","v":{"$error":"#DIV/0!"}},7.8768349652240957E-2,7.1904174172012104E-3,null,null,3.8333333333333317]
[{"$f":"runoff!A28","v":"04:00:00"},{"$f":"浸透計算!C29","v":9.2530000000000008E-3},{"$f":"runoff!$B$1","v":{"$error":"#DIV/0!"}},8.0558591816626821E-2,7.4254235152141764E-3,null,null,3.9999999999999982]
[{"$f":"runoff!A29","v":"04:10:00"},{"$f":"浸透計算!C30","v":9.5029999999999993E-3},{"$f":"runoff!$B$1","v":{"$error":"#DIV/0!"}},8.2239398854171239E-2,7.6629355084455054E-3,null,null,4.1666666666666652]
[{"$f":"runoff!A30","v":"04:20:00"},{"$f":"浸透計算!C31","v":9.7529999999999995E-3},{"$f":"runoff!$B$1","v":{"$error":"#DIV/0!"}},8.3825254251952641E-2,7.8684918493989817E-3,null,null,4.3333333333333321]
[{"$f":"runoff!A31","v":"04:30:00"},{"$f":"浸透計算!C32","v":1.0003E-2},{"$f":"runoff!$B$1","v":{"$error":"#DIV/0!"}},8.5436853912774127E-2,8.1105888402639922E-3,null,null,4.4999999999999991]
[{"$f":"runoff!A32","v":"04:40:00"},{"$f":"浸透計算!C33","v":1.0253E-2},{"$f":"runoff!$B$1","v":{"$error":"#DIV/0!"}},8.7063659838138394E-2,8.3375724448286909E-3,null,null,4.6666666666666661]
[{"$f":"runoff!A33","v":"04:50:00"},{"$f":"浸透計算!C34","v":1.0503E-2},{"$f":"runoff!$B$1","v":{"$error":"#DIV/0!"}},8.8703374721860129E-2,8.5843406249370841E-3,null,null,4.833333333333333]
[{"$f":"runoff!A34","v":"05:00:00"},{"$f":"浸透計算!C35","v":1.0753E-2},{"$f":"runoff!$B$1","v":{"$error":"#DIV/0!"}},9.0353885452546995E-2,8.8156208893329681E-3,null,null,5]
[{"$f":"runoff!A35","v":"05:10:00"},{"$f":"浸透計算!C36","v":1.1003000000000001E-2},{"$f":"runoff!$B$1","v":{"$error":"#DIV/0!"}},9.2012937411588017E-2,9.0669734606169308E-3,null,null,5.166666666666667]
[{"$f":"runoff!A36","v":"05:20:00"},{"$f":"浸透計算!C37","v":1.1253000000000001E-2},{"$f":"runoff!$B$1","v":{"$error":"#DIV/0!"}},9.3669505950187817E-2,9.3206705108968193E-3,null,null,5.3333333333333339]
[{"$f":"runoff!A37","v":"05:30:00"},{"$f":"浸透計算!C38","v":1.1502999999999999E-2},{"$f":"runoff!$B$1","v":{"$error":"#DIV/0!"}},9.533032692813076E-2,9.5583268339525518E-3,null,null,5.5000000000000009]
[{"$f":"runoff!A38","v":"05:40:00"},{"$f":"浸透計算!C39","v":1.1753E-2},{"$f":"runoff!$B$1","v":{"$error":"#DIV/0!"}},9.6993206227167214E-2,9.8164852580066592E-3,null,null,5.6666666666666679]
[{"$f":"runoff!A39","v":"05:50:00"},{"$f":"浸透計算!C40","v":1.2003E-2},{"$f":"runoff!$B$1","v":{"$error":"#DIV/0!"}},9.8656123985537955E-2,1.0058248633306155E-2,null,null,5.8333333333333348]
[{"$f":"runoff!A40","v":"06:00:00"},{"$f":"浸透計算!C41","v":1.2253E-2},{"$f":"runoff!$B$1","v":{"$error":"#DIV/0!"}},0.10031692336492436,1.0320792628608138E-2,null,null,6.0000000000000018]
[{"$f":"runoff!A41","v":"06:10:00"},{"$f":"浸透計算!C42","v":1.2503E-2},{"$f":"runoff!$B$1","v":{"$error":"#DIV/0!"}},0.10196428009088615,1.058558202860291E-2,null,null,6.1666666666666687]
[{"$f":"runoff!A42","v":"06:20:00"},{"$f":"浸透計算!C43","v":1.3003000000000001E-2},{"$f":"runoff!$B$1","v":{"$error":"#DIV/0!"}},0.10361482145158804,1.081431720463656E-2,null,null,6.3333333333333357]
[{"$f":"runoff!A43","v":"06:30:00"},{"$f":"浸透計算!C44","v":1.3252999999999999E-2},{"$f":"runoff!$B$1","v":{"$error":"#DIV/0!"}},0.10537049070340296,1.1121821983339802E-2,null,null,6.5000000000000027]
[{"$f":"runoff!A44","v":"06:40:00"},{"$f":"浸透計算!C45","v":1.3753E-2},{"$f":"runoff!$B$1","v":{"$error":"#DIV/0!"}},0.10721029817360304,1.1393236160586667E-2,null,null,6.6666666666666696]
[{"$f":"runoff!A45","v":"06:50:00"},{"$f":"浸透計算!C46","v":1.4003E-2},{"$f":"runoff!$B$1","v":{"$error":"#DIV/0!"}},0.10913161655500819,1.1706083130556207E-2,null,null,6.8333333333333366]
[{"$f":"runoff!A46","v":"07:00:00"},{"$f":"浸透計算!C47","v":1.4503E-2},{"$f":"runoff!$B$1","v":{"$error":"#DIV/0!"}},0.11111268601422088,1.2021742302378017E-2,null,null,7.0000000000000036]
[{"$f":"runoff!A47","v":"07:10:00"},{"$f":"浸透計算!C48","v":1.5003000000000001E-2},{"$f":"runoff!$B$1","v":{"$error":"#DIV/0!"}},0.11314091910599716,1.2360183744343523E-2,null,null,7.1666666666666705]
[{"$f":"runoff!A48","v":"07:20:00"},{"$f":"浸透計算!C49","v":1.5252999999999999E-2},{"$f":"runoff!$B$1","v":{"$error":"#DIV/0!"}},0.11531660033990561,1.2721931080042659E-2,null,null,7.3333333333333375]
[{"$f":"runoff!A49","v":"07:30:00"},{"$f":"浸透計算!C50","v":1.5753E-2},{"$f":"runoff!$B$1","v":{"$error":"#DIV/0!"}},0.1175036144427363,1.3087140244201585E-2,null,null,7.5000000000000044]
[{"$f":"runoff!A50","v":"07:40:00"},{"$f":"浸透計算!C51","v":1.6503E-2},{"$f":"runoff!$B$1","v":{"$error":"#DIV/0!"}},0.11969857232536411,1.3455778727788505E-2,null,null,7.6666666666666714]
[{"$f":"runoff!A51","v":"07:50:00"},{"$f":"浸透計算!C52","v":1.7003000000000001E-2},{"$f":"runoff!$B$1","v":{"$error":"#DIV/0!"}},0.12212358573782665,1.3869360666871021E-2,null,null,7.8333333333333384]
[{"$f":"runoff!A52","v":"08:00:00"},{"$f":"浸透計算!C53","v":1.7503000000000001E-2},{"$f":"runoff!$B$1","v":{"$error":"#DIV/0!"}},0.12474418367060043,1.4308090203155602E-2,null,null,8.0000000000000053]
[{"$f":"runoff!A53","v":"08:10:00"},{"$f":"浸透計算!C54","v":1.8252999999999998E-2},{"$f":"runoff!$B$1","v":{"$error":"#DIV/0!"}},0.12741238328356397,1.4772570583818556E-2,null,null,8.1666666666666714]
[{"$f":"runoff!A54","v":"08:20:00"},{"$f":"浸透計算!C55","v":1.8752999999999999E-2},{"$f":"runoff!$B$1","v":{"$error":"#DIV/0!"}},0.13022550093837723,1.5263423518061136E-2,null,null,8.3333333333333375]
[{"$f":"runoff!A55","v":"08:30:00"},{"$f":"浸透計算!C56","v":1.9503E-2},{"$f":"runoff!$B$1","v":{"$error":"#DIV/0!"}},0.13315728205055008,1.5781288220520683E-2,null,null,8.5000000000000036]
[{"$f":"runoff!A56","v":"08:40:00"},{"$f":"浸透計算!C57","v":2.0503E-2},{"$f":"runoff!$B$1","v":{"$error":"#DIV/0!"}},0.13619162518018937,1.6304880749212755E-2,null,null,8.6666666666666696]
[{"$f":"runoff!A57","v":"08:50:00"},{"$f":"浸透計算!C58","v":2.1253000000000001E-2},{"$f":"runoff!$B$1","v":{"$error":"#DIV/0!"}},0.1395251778700545,1.6922895448061522E-2,null,null,8.8333333333333357]
[{"$f":"runoff!A58","v":"09:00:00"},{"$f":"浸透計算!C59","v":2.2252999999999998E-2},{"$f":"runoff!$B$1","v":{"$error":"#DIV/0!"}},0.14309669943580908,1.7571010701570838E-2,null,null,9.0000000000000018]
[{"$f":"runoff!A59","v":"09:10:00"},{"$f":"浸透計算!C60","v":2.3252999999999999E-2},{"$f":"runoff!$B$1","v":{"$error":"#DIV/0!"}},0.14686501685953013,1.8272743870196284E-2,null,null,9.1666666666666679]
[{"$f":"runoff!A60","v":"09:20:00"},{"$f":"浸透計算!C61","v":2.4503E-2},{"$f":"runoff!$B$1","v":{"$error":"#DIV/0!"}},0.15089952916988611,1.9029747765413253E-2,null,null,9.3333333333333339]
[{"$f":"runoff!A61","v":"09:30:00"},{"$f":"浸透計算!C62","v":2.5753000000000002E-2},{"$f":"runoff!$B$1","v":{"$error":"#DIV/0!"}},0.15525645520281206,1.9867169300970679E-2,null,null,9.5]
[{"$f":"runoff!A62","v":"09:40:00"},{"$f":"浸透計算!C63","v":2.7252999999999999E-2},{"$f":"runoff!$B$1","v":{"$error":"#DIV/0!"}},0.15998994912878689,2.0764059716213815E-2,null,null,9.6666666666666661]
[{"$f":"runoff!A63","v":"09:50:00"},{"$f":"浸透計算!C64","v":2.8753000000000001E-2},{"$f":"runoff!$B$1","v":{"$error":"#DIV/0!"}},0.16512790838243963,2.179475646802562E-2,null,null,9.8333333333333321]
[{"$f":"runoff!A64","v":"10:00:00"},{"$f":"浸透計算!C65","v":3.0752999999999999E-2},{"$f":"runoff!$B$1","v":{"$error":"#DIV/0!"}},0.1706831256601998,2.2915635067195329E-2,null,null,9.9999999999999982]
[{"$f":"runoff!A65","v":"10:10:00"},{"$f":"浸透計算!C66","v":3.2752999999999997E-2},{"$f":"runoff!$B$1","v":{"$error":"#DIV/0!"}},0.17679885532389986,2.4155047949947935E-2,null,null,10.166666666666664]
[{"$f":"runoff!A66","v":"10:20:00"},{"$f":"浸透計算!C67","v":3.5253E-2},{"$f":"runoff!$B$1","v":{"$error":"#DIV/0!"}},0.18358950167419499,2.5543304471118605E-2,null,null,10.33333333333333]
[{"$f":"runoff!A67","v":"10:30:00"},{"$f":"浸透計算!C68","v":3.8253000000000002E-2},{"$f":"runoff!$B$1","v":{"$error":"#DIV/0!"}},0.19112577238198761,2.7138945089703045E-2,null,null,10.499999999999996]
[{"$f":"runoff!A68","v":"10:40:00"},{"$f":"浸透計算!C69","v":4.1752999999999998E-2},{"$f":"runoff!$B$1","v":{"$error":"#DIV/0!"}},0.19967737718805981,2.8978791804616866E-2,null,null,10.666666666666663]
[{"$f":"runoff!A69","v":"10:50:00"},{"$f":"浸透計算!C70","v":4.6003000000000002E-2},{"$f":"runoff!$B$1","v":{"$error":"#DIV/0!"}},0.20946281431675698,3.1130152700365551E-2,null,null,10.833333333333329]
[{"$f":"runoff!A70","v":"11:00:00"},{"$f":"浸透計算!C71","v":5.1503E-2},{"$f":"runoff!$B$1","v":{"$error":"#DIV/0!"}},0.22075410612931626,3.3666887280763898E-2,null,null,{"$f":"H68+1/6","v":10.999999999999995}]
[{"$f":"runoff!A71","v":"11:10:00"},{"$f":"浸透計算!C72","v":5.8753E-2},{"$f":"runoff!$B$1","v":{"$error":"#DIV/0!"}},0.2340590963099366,3.6785632685308149E-2,null,null,11.166666666666661]
[{"$f":"runoff!A72","v":"11:20:00"},{"$f":"浸透計算!C73","v":6.8502999999999994E-2},{"$f":"runoff!$B$1","v":{"$error":"#DIV/0!"}},0.25072656349131023,3.9579850712565458E-2,null,null,11.333333333333327]
[{"$f":"runoff!A73","v":"11:30:00"},{"$f":"浸透計算!C74","v":8.3002999999999993E-2},{"$f":"runoff!$B$1","v":{"$error":"#DIV/0!"}},0.27389719228984155,4.0562537397087435E-2,null,null,11.499999999999993]
[{"$f":"runoff!A74","v":"11:40:00"},{"$f":"浸透計算!C75","v":0.107253},{"$f":"runoff!$B$1","v":{"$error":"#DIV/0!"}},0.30780363463015992,4.2000363177598532E-2,null,null,11.666666666666659]
[{"$f":"runoff!A75","v":"11:50:00"},{"$f":"浸透計算!C76","v":0.157253},{"$f":"runoff!$B$1","v":{"$error":"#DIV/0!"}},0.35899454818934329,4.4167445918728579E-2,null,null,11.833333333333325]
[{"$f":"runoff!A76","v":"12:00:00"},{"$f":"浸透計算!C77","v":0.38500299999999998},{"$f":"runoff!$B$1","v":{"$error":"#DIV/0!"}},0.4425511368867675,5.0440157063175499E-2,null,null,11.999999999999991]
[{"$f":"runoff!A77","v":"12:10:00"},{"$f":"浸透計算!C78","v":0.213503},{"$f":"runoff!$B$1","v":{"$error":"#DIV/0!"}},0.65287309311612263,6.4161198603802316E-2,null,null,12.166666666666657]
[{"$f":"runoff!A78","v":"12:20:00"},{"$f":"浸透計算!C79","v":0.126753},{"$f":"runoff!$B$1","v":{"$error":"#DIV/0!"}},0.87820975402653911,7.616025754501779E-2,null,null,12.333333333333323]
[{"$f":"runoff!A79","v":"12:30:00"},{"$f":"浸透計算!C80","v":9.3253000000000003E-2},{"$f":"runoff!$B$1","v":{"$error":"#DIV/0!"}},0.96852054801238874,8.046379468375435E-2,null,null,12.499999999999989]
[{"$f":"runoff!A80","v":"12:40:00"},{"$f":"浸透計算!C81","v":7.5003E-2},{"$f":"runoff!$B$1","v":{"$error":"#DIV/0!"}},0.9969312819192836,8.1773713038892817E-2,null,null,12.666666666666655]
[{"$f":"runoff!A81","v":"12:50:00"},{"$f":"浸透計算!C82","v":6.3253000000000004E-2},{"$f":"runoff!$B$1","v":{"$error":"#DIV/0!"}},0.99919489535531281,8.1879606307847672E-2,null,null,12.833333333333321]
[{"$f":"runoff!A82","v":"13:00:00"},{"$f":"浸透計算!C83","v":5.5003000000000003E-2},{"$f":"runoff!$B$1","v":{"$error":"#DIV/0!"}},0.98692994889790264,8.1315118155553104E-2,null,null,12.999999999999988]
[{"$f":"runoff!A83","v":"13:10:00"},{"$f":"浸透計算!C84","v":4.8752999999999998E-2},{"$f":"runoff!$B$1","v":{"$error":"#DIV/0!"}},0.9655921920906666,8.0327654019160019E-2,null,null,13.166666666666654]
[{"$f":"runoff!A84","v":"13:20:00"},{"$f":"浸透計算!C85","v":4.3753E-2},{"$f":"runoff!$B$1","v":{"$error":"#DIV/0!"}},0.93823939419840396,7.9045701695107232E-2,null,null,13.33333333333332]
[{"$f":"runoff!A85","v":"13:30:00"},{"$f":"浸透計算!C86","v":4.0002999999999997E-2},{"$f":"runoff!$B$1","v":{"$error":"#DIV/0!"}},0.90672335620744582,7.7542908886507805E-2,null,null,13.499999999999986]
[{"$f":"runoff!A86","v":"13:40:00"},{"$f":"浸透計算!C87","v":3.6753000000000001E-2},{"$f":"runoff!$B$1","v":{"$error":"#DIV/0!"}},0.87246177805680591,7.5878300019793218E-2,null,null,13.666666666666652]
[{"$f":"runoff!A87","v":"13:50:00"},{"$f":"浸透計算!C88","v":3.4002999999999999E-2},{"$f":"runoff!$B$1","v":{"$error":"#DIV/0!"}},0.83646167524601545,7.407790902881406E-2,null,null,13.833333333333318]
[{"$f":"runoff!A88","v":"14:00:00"},{"$f":"浸透計算!C89","v":3.1753000000000003E-2},{"$f":"runoff!$B$1","v":{"$error":"#DIV/0!"}},0.79932854076812432,7.2182131076231393E-2,null,null,13.999999999999984]
[{"$f":"runoff!A89","v":"14:10:00"},{"$f":"浸透計算!C90","v":2.9753000000000002E-2},{"$f":"runoff!$B$1","v":{"$error":"#DIV/0!"}},0.76163902195919286,7.0209223835262569E-2,null,null,14.16666666666665]
[{"$f":"runoff!A90","v":"14:20:00"},{"$f":"浸透計算!C91","v":2.8003E-2},{"$f":"runoff!$B$1","v":{"$error":"#DIV/0!"}},0.72383454901971656,6.816587114167269E-2,null,null,14.333333333333316]
[{"$f":"runoff!A91","v":"14:30:00"},{"$f":"浸透計算!C92","v":2.6502999999999999E-2},{"$f":"runoff!$B$1","v":{"$error":"#DIV/0!"}},0.68621994882138126,6.6073149261609107E-2,null,null,14.499999999999982]
[{"$f":"runoff!A92","v":"14:40:00"},{"$f":"浸透計算!C93","v":2.5003000000000001E-2},{"$f":"runoff!$B$1","v":{"$error":"#DIV/0!"}},0.64908505106380232,6.3940476178801456E-2,null,null,14.666666666666648]
[{"$f":"runoff!A93","v":"14:50:00"},{"$f":"浸透計算!C94","v":2.4003E-2},{"$f":"runoff!$B$1","v":{"$error":"#DIV/0!"}},0.61259413808683716,6.1763713541027679E-2,null,null,14.833333333333314]
[{"$f":"runoff!A94","v":"15:00:00"},{"$f":"浸透計算!C95","v":2.2752999999999999E-2},{"$f":"runoff!$B$1","v":{"$error":"#DIV/0!"}},0.57702002707928846,5.9576312174321334E-2,null,null,14.99999999999998]
[{"$f":"runoff!A95","v":"15:10:00"},{"$f":"浸透計算!C96","v":2.1753000000000002E-2},{"$f":"runoff!$B$1","v":{"$error":"#DIV/0!"}},0.5425006408238966,5.7369106544975505E-2,null,null,15.166666666666647]
[{"$f":"runoff!A96","v":"15:20:00"},{"$f":"浸透計算!C97","v":2.0753000000000001E-2},{"$f":"runoff!$B$1","v":{"$error":"#DIV/0!"}},0.50905256125275022,5.5147988583022008E-2,null,null,15.333333333333313]
[{"$f":"runoff!A97","v":"15:30:00"},{"$f":"浸透計算!C98","v":2.0003E-2},{"$f":"runoff!$B$1","v":{"$error":"#DIV/0!"}},0.47680904653774459,5.2919824670822804E-2,null,null,15.499999999999979]
[{"$f":"runoff!A98","v":"15:40:00"},{"$f":"浸透計算!C99","v":1.9252999999999999E-2},{"$f":"runoff!$B$1","v":{"$error":"#DIV/0!"}},0.44590043495300574,5.0683685551479493E-2,null,null,15.666666666666645]
[{"$f":"runoff!A99","v":"15:50:00"},{"$f":"浸透計算!C100","v":1.8502999999999999E-2},{"$f":"runoff!$B$1","v":{"$error":"#DIV/0!"}},0.41643955091347723,4.8476111995561802E-2,null,null,15.833333333333311]
[{"$f":"runoff!A100","v":"16:00:00"},{"$f":"浸透計算!C101","v":1.7753000000000001E-2},{"$f":"runoff!$B$1","v":{"$error":"#DIV/0!"}},0.38841567205983224,4.6261775006849609E-2,null,null,15.999999999999977]
[{"$f":"runoff!A101","v":"16:10:00"},{"$f":"浸透計算!C102","v":1.7253000000000001E-2},{"$f":"runoff!$B$1","v":{"$error":"#DIV/0!"}},0.36171714466659843,4.4281230692725861E-2,null,null,16.166666666666643]
[{"$f":"runoff!A102","v":"16:20:00"},{"$f":"浸透計算!C103","v":1.6753000000000001E-2},{"$f":"runoff!$B$1","v":{"$error":"#DIV/0!"}},0.33591460599670619,4.3189931269388297E-2,null,null,16.333333333333311]
[{"$f":"runoff!A103","v":"16:30:00"},{"$f":"浸透計算!C104","v":1.6003E-2},{"$f":"runoff!$B$1","v":{"$error":"#DIV/0!"}},0.31068349882154267,4.2119319986777509E-2,null,null,16.499999999999979]
[{"$f":"runoff!A104","v":"16:40:00"},{"$f":"浸透計算!C105","v":1.5502999999999999E-2},{"$f":"runoff!$B$1","v":{"$error":"#DIV/0!"}},0.28588052333055691,4.1069396844893503E-2,null,null,16.666666666666647]
[{"$f":"runoff!A105","v":"16:50:00"},{"$f":"浸透計算!C106","v":1.5252999999999999E-2},{"$f":"runoff!$B$1","v":{"$error":"#DIV/0!"}},0.26148787415673003,4.0034989808554584E-2,null,null,16.833333333333314]
[{"$f":"runoff!A106","v":"17:00:00"},{"$f":"浸透計算!C107","v":1.4753E-2},{"$f":"runoff!$B$1","v":{"$error":"#DIV/0!"}},0.23834996505362649,3.7768092034422586E-2,null,null,16.999999999999982]
[{"$f":"runoff!A107","v":"17:10:00"},{"$f":"浸透計算!C108","v":1.4253E-2},{"$f":"runoff!$B$1","v":{"$error":"#DIV/0!"}},0.21824903304440277,3.3109803050998969E-2,null,null,17.16666666666665]
[{"$f":"runoff!A108","v":"17:20:00"},{"$f":"浸透計算!C109","v":1.3753E-2},{"$f":"runoff!$B$1","v":{"$error":"#DIV/0!"}},0.20175618742005599,2.9431649718506116E-2,null,null,17.333333333333318]
[{"$f":"runoff!A109","v":"17:30:00"},{"$f":"浸透計算!C110","v":1.3502999999999999E-2},{"$f":"runoff!$B$1","v":{"$error":"#DIV/0!"}},0.18803903961975144,2.6465884142113146E-2,null,null,17.499999999999986]
[{"$f":"runoff!A110","v":"17:40:00"},{"$f":"浸透計算!C111","v":1.3003000000000001E-2},{"$f":"runoff!$B$1","v":{"$error":"#DIV/0!"}},0.17658496326404821,2.4080071114483455E-2,null,null,17.666666666666654]
[{"$f":"runoff!A111","v":"17:50:00"},{"$f":"浸透計算!C112","v":1.2753E-2},{"$f":"runoff!$B$1","v":{"$error":"#DIV/0!"}},0.16689251459138313,2.2133907853268863E-2,null,null,17.833333333333321]
[{"$f":"runoff!A112","v":"18:00:00"},{"$f":"浸透計算!C113","v":1.2503E-2},{"$f":"runoff!$B$1","v":{"$error":"#DIV/0!"}},0.15859039066938696,2.0503077454789975E-2,null,null,17.999999999999989]
[{"$f":"runoff!A113","v":"18:10:00"},{"$f":"浸透計算!C114","v":1.2253E-2},{"$f":"runoff!$B$1","v":{"$error":"#DIV/0!"}},0.15151215442756152,1.914533623692178E-2,null,null,18.166666666666657]
[{"$f":"runoff!A114","v":"18:20:00"},{"$f":"浸透計算!C115","v":1.1753E-2},{"$f":"runoff!$B$1","v":{"$error":"#DIV/0!"}},0.14540787726634391,1.8022693990887368E-2,null,null,18.333333333333325]
[{"$f":"runoff!A115","v":"18:30:00"},{"$f":"浸透計算!C116","v":1.1502999999999999E-2},{"$f":"runoff!$B$1","v":{"$error":"#DIV/0!"}},0.13998402421193221,1.7011807219749778E-2,null,null,18.499999999999993]
[{"$f":"runoff!A116","v":"18:40:00"},{"$f":"浸透計算!C117","v":1.1253000000000001E-2},{"$f":"runoff!$B$1","v":{"$error":"#DIV/0!"}},0.13512229081740601,1.6129717349120137E-2,null,null,18.666666666666661]
[{"$f":"runoff!A117","v":"18:50:00"},{"$f":"浸透計算!C118","v":1.1003000000000001E-2},{"$f":"runoff!$B$1","v":{"$error":"#DIV/0!"}},0.13082169055020113,1.5370836527529796E-2,null,null,18.833333333333329]
[{"$f":"runoff!A118","v":"19:00:00"},{"$f":"浸透計算!C119","v":1.0753E-2},{"$f":"runoff!$B$1","v":{"$error":"#DIV/0!"}},0.12698435186786261,1.4687752126558524E-2,null,null,18.999999999999996]
[{"$f":"runoff!A119","v":"19:10:00"},{"$f":"浸透計算!C120","v":1.0503E-2},{"$f":"runoff!$B$1","v":{"$error":"#DIV/0!"}},0.12352679995876903,1.4098603421931758E-2,null,null,19.166666666666664]
[{"$f":"runoff!A120","v":"19:20:00"},{"$f":"浸透計算!C121","v":1.0253E-2},{"$f":"runoff!$B$1","v":{"$error":"#DIV/0!"}},0.12037857731302527,1.3558782624413861E-2,null,null,19.333333333333332]
[{"$f":"runoff!A121","v":"19:30:00"},{"$f":"浸透計算!C122","v":1.0003E-2},{"$f":"runoff!$B$1","v":{"$error":"#DIV/0!"}},0.11749191671896413,1.3066760583510474E-2,null,null,19.5]
[{"$f":"runoff!A122","v":"19:40:00"},{"$f":"浸透計算!C123","v":9.7529999999999995E-3},{"$f":"runoff!$B$1","v":{"$error":"#DIV/0!"}},0.11482051132728652,1.2621097046233975E-2,null,null,19.666666666666668]
[{"$f":"runoff!A123","v":"19:50:00"},{"$f":"浸透計算!C124","v":9.7529999999999995E-3},{"$f":"runoff!$B$1","v":{"$error":"#DIV/0!"}},0.1123194244386371,1.2220446294019837E-2,null,null,19.833333333333336]
[{"$f":"runoff!A124","v":"20:00:00"},{"$f":"浸透計算!C125","v":9.5029999999999993E-3},{"$f":"runoff!$B$1","v":{"$error":"#DIV/0!"}},0.1100679445765633,1.1863562758863576E-2,null,null,20.000000000000004]
[{"$f":"runoff!A125","v":"20:10:00"},{"$f":"浸透計算!C126","v":9.2530000000000008E-3},{"$f":"runoff!$B$1","v":{"$error":"#DIV/0!"}},0.10803319614186338,1.1529759058359566E-2,null,null,20.166666666666671]
[{"$f":"runoff!A126","v":"20:20:00"},{"$f":"浸透計算!C127","v":9.0030000000000006E-3},{"$f":"runoff!$B$1","v":{"$error":"#DIV/0!"}},0.10606978753060936,1.1218505117856941E-2,null,null,20.333333333333339]
[{"$f":"runoff!A127","v":"20:30:00"},{"$f":"浸透計算!C128","v":9.0030000000000006E-3},{"$f":"runoff!$B$1","v":{"$error":"#DIV/0!"}},0.10415578767923986,1.0929294579927683E-2,null,null,20.500000000000007]
[{"$f":"runoff!A128","v":"20:40:00"},{"$f":"浸透計算!C129","v":8.7530000000000004E-3},{"$f":"runoff!$B$1","v":{"$error":"#DIV/0!"}},0.10240206267736256,1.0642612923889513E-2,null,null,20.666666666666675]
[{"$f":"runoff!A129","v":"20:50:00"},{"$f":"浸透計算!C130","v":8.5030000000000001E-3},{"$f":"runoff!$B$1","v":{"$error":"#DIV/0!"}},0.10078755544199677,1.0396218454687573E-2,null,null,20.833333333333343]
[{"$f":"runoff!A130","v":"21:00:00"},{"$f":"浸透計算!C131","v":8.5030000000000001E-3},{"$f":"runoff!$B$1","v":{"$error":"#DIV/0!"}},9.9177760647714636E-2,1.0133030960352779E-2,null,null,21.000000000000011]
[{"$f":"runoff!A131","v":"21:10:00"},{"$f":"浸透計算!C132","v":8.2529999999999999E-3},{"$f":"runoff!$B$1","v":{"$error":"#DIV/0!"}},9.7684513092865716E-2,9.9092390678400186E-3,null,null,21.166666666666679]
[{"$f":"runoff!A132","v":"21:20:00"},{"$f":"浸透計算!C133","v":8.0029999999999997E-3},{"$f":"runoff!$B$1","v":{"$error":"#DIV/0!"}},9.6287615494123124E-2,9.6871193829365897E-3,null,null,21.333333333333346]
[{"$f":"runoff!A133","v":"21:30:00"},{"$f":"浸透計算!C134","v":8.0029999999999997E-3},{"$f":"runoff!$B$1","v":{"$error":"#DIV/0!"}},9.4853463590109488E-2,9.4849894885577889E-3,null,null,21.500000000000014]
[{"$f":"runoff!A134","v":"21:40:00"},{"$f":"浸透計算!C135","v":7.7530000000000003E-3},{"$f":"runoff!$B$1","v":{"$error":"#DIV/0!"}},9.3494475961784701E-2,9.2842853557026234E-3,null,null,{"$f":"H132+1/6","v":21.666666666666682}]
[{"$f":"runoff!A135","v":"21:50:00"},{"$f":"浸透計算!C136","v":7.7530000000000003E-3},{"$f":"runoff!$B$1","v":{"$error":"#DIV/0!"}},9.2200365361924233E-2,9.1030728640136647E-3,null,null,21.83333333333335]
[{"$f":"runoff!A136","v":"22:00:00"},{"$f":"浸透計算!C137","v":7.5030000000000001E-3},{"$f":"runoff!$B$1","v":{"$error":"#DIV/0!"}},9.0969779123723296E-2,8.9051191536615656E-3,null,null,22.000000000000018]
[{"$f":"runoff!A137","v":"22:10:00"},{"$f":"浸透計算!C138","v":7.5030000000000001E-3},{"$f":"runoff!$B$1","v":{"$error":"#DIV/0!"}},8.9792717460666596E-2,8.7442395612203957E-3,null,null,22.166666666666686]
[{"$f":"runoff!A138","v":"22:20:00"},{"$f":"浸透計算!C139","v":7.2529999999999999E-3},{"$f":"runoff!$B$1","v":{"$error":"#DIV/0!"}},8.8659172657156199E-2,8.5666348725840728E-3,null,null,22.333333333333353]
[{"$f":"runoff!A139","v":"22:30:00"},{"$f":"浸透計算!C140","v":7.2529999999999999E-3},{"$f":"runoff!$B$1","v":{"$error":"#DIV/0!"}},8.7559469410086979E-2,8.4254283964566527E-3,null,null,22.500000000000021]
[{"$f":"runoff!A140","v":"22:40:00"},{"$f":"浸透計算!C141","v":7.0029999999999997E-3},{"$f":"runoff!$B$1","v":{"$error":"#DIV/0!"}},8.6492525605610188E-2,8.250024005979505E-3,null,null,22.666666666666689]
[{"$f":"runoff!A141","v":"22:50:00"},{"$f":"浸透計算!C142","v":7.0029999999999997E-3},{"$f":"runoff!$B$1","v":{"$error":"#DIV/0!"}},8.5457470107457648E-2,8.1105888402639922E-3,null,null,22.833333333333357]
[{"$f":"runoff!A142","v":"23:00:00"},{"$f":"浸透計算!C143","v":6.7530000000000003E-3},{"$f":"runoff!$B$1","v":{"$error":"#DIV/0!"}},8.4436222388788604E-2,7.9719481876963979E-3,null,null,23.000000000000025]
[{"$f":"runoff!A143","v":"23:10:00"},{"$f":"浸透計算!C144","v":6.7530000000000003E-3},{"$f":"runoff!$B$1","v":{"$error":"#DIV/0!"}},8.3427998709039788E-2,7.8341066277928546E-3,null,null,23.166666666666693]
[{"$f":"runoff!A144","v":"23:20:00"},{"$f":"浸透計算!C145","v":6.5030000000000001E-3},{"$f":"runoff!$B$1","v":{"$error":"#DIV/0!"}},8.2432010783805632E-2,7.6970688201832716E-3,null,null,23.333333333333361]
[{"$f":"runoff!A145","v":"23:30:00"},{"$f":"浸透計算!C146","v":6.5030000000000001E-3},{"$f":"runoff!$B$1","v":{"$error":"#DIV/0!"}},8.1447465704875419E-2,7.5608395069748195E-3,null,null,23.500000000000028]
[{"$f":"runoff!A146","v":"23:40:00"},{"$f":"浸透計算!C147","v":6.2529999999999999E-3},{"$f":"runoff!$B$1","v":{"$error":"#DIV/0!"}},8.0473565857897222E-2,7.4254235152141764E-3,null,null,23.666666666666696]
[{"$f":"runoff!A147","v":"23:50:00"},{"$f":"浸透計算!C148","v":6.2529999999999999E-3},{"$f":"runoff!$B$1","v":{"$error":"#DIV/0!"}},7.9509508837568632E-2,7.2908257594539571E-3,null,null,23.833333333333364]
[{"$f":"runoff!A148","v":1},{"$f":"浸透計算!C149","v":6.2529999999999999E-3},{"$f":"runoff!$B$1","v":{"$error":"#DIV/0!"}},7.8554487360249128E-2,7.1570512444290172E-3,null,null,24.000000000000032]
[null,null,null,7.7730639993555131E-2,7.0241050678487849E-3]

{"sheet":"調節計算（自然調節方式）","index":19,"n_rows":151,"n_cols":8,"rows_kept":151,"cut":false,"hidden":true,"merged":[]}
[]
[null,null,null,null,{"$f":"MAX(E7:E151)","v":7.91681348704628E-2}]
[]
[]
[]
["時刻","行為後流入量","浸透考慮後流入量","許容放流量","調節後放流量","調整池水位"]
["00:00:00",0,0,8.6440000000000003E-2,0,0,0,0]
["00:10:00",1.025E-2,6.2529999999999999E-3,8.6440000000000003E-2,0,3.0752459016393442E-3,1.8758999999999999,{"$f":"H7+1/6","v":0.16666666666666666}]
["00:20:00",1.025E-2,6.2529999999999999E-3,8.6440000000000003E-2,2.7391139869943973E-4,9.0910271809674873E-3,5.5455265803901677,{"$f":"H8+1/6","v":0.33333333333333331}]
["00:30:00",1.0500000000000001E-2,6.5030000000000001E-3,8.6440000000000003E-2,5.7983212325380523E-4,1.4944595940662615E-2,9.1162035238041952,0.5]
["00:40:00",1.0500000000000001E-2,6.5030000000000001E-3,8.6440000000000003E-2,9.3697164563269323E-4,2.0595020316620076E-2,12.562962393138246,0.66666666666666663]
["00:50:00",1.0749999999999999E-2,6.7530000000000003E-3,8.6440000000000003E-2,1.3376174666444036E-3,2.5995714195828062E-2,15.857385659455117,0.83333333333333326]
["01:00:00",1.0749999999999999E-2,6.7530000000000003E-3,8.6440000000000003E-2,1.7521561068595283E-3,3.1118448503940882E-2,18.982253587403939,0.99999999999999989]
["01:10:00",1.0749999999999999E-2,6.7530000000000003E-3,8.6440000000000003E-2,2.158062193561992E-3,3.5837685405372924E-2,21.860988097277485,1.1666666666666665]
["01:20:00",1.0999999999999999E-2,7.0029999999999997E-3,8.6440000000000003E-2,2.5794875484848423E-3,4.0272988810923664E-2,24.566523174663434,1.3333333333333333]
["01:30:00",1.0999999999999999E-2,7.0029999999999997E-3,8.6440000000000003E-2,2.9882339907180305E-3,4.4422961824430444E-2,27.098006712902571,1.5]
["01:40:00",1.125E-2,7.2529999999999999E-3,8.6440000000000003E-2,3.3908244410612372E-3,4.8296867513719331E-2,29.461089183368792,1.6666666666666667]
["01:50:00",1.125E-2,7.2529999999999999E-3,8.6440000000000003E-2,3.7833535251913129E-3,5.1902681628677089E-2,31.660635793493025,1.8333333333333335]
["02:00:00",1.15E-2,7.5030000000000001E-3,8.6440000000000003E-2,4.134949198399517E-3,5.5265483567894721E-2,33.711944976415779,2]
["02:10:00",1.15E-2,7.5030000000000001E-3,8.6440000000000003E-2,4.4968082692964824E-3,5.8400356944437667E-2,35.624217736106978,2.1666666666666665]
["02:20:00",1.175E-2,7.7530000000000003E-3,8.6440000000000003E-2,4.8396962109866059E-3,6.1311584249216483E-2,37.400066392022055,2.333333333333333]
["02:30:00",1.2E-2,8.0029999999999997E-3,8.6440000000000003E-2,5.1908818290473989E-3,6.412736554100304E-2,39.117692980011853,2.4999999999999996]
["02:40:00",1.2E-2,8.0029999999999997E-3,8.6440000000000003E-2,5.4897363819748938E-3,6.6746405765090444E-2,40.715307516705167,2.6666666666666661]
["02:50:00",1.225E-2,8.2529999999999999E-3,8.6440000000000003E-2,5.7941158281634639E-3,6.9191724350268297E-2,42.206951853663661,2.8333333333333326]
["03:00:00",1.225E-2,8.2529999999999999E-3,8.6440000000000003E-2,6.1039216451600027E-3,7.1457935428961672E-2,43.589340611666621,2.9999999999999991]
["03:10:00",1.2500000000000001E-2,8.5030000000000001E-3,8.6440000000000003E-2,6.3556103394709403E-3,7.3570952485700558E-2,44.878281016277342,3.1666666666666656]
["03:20:00",1.2749999999999999E-2,8.7530000000000004E-3,8.6440000000000003E-2,6.6427829187540857E-3,7.5664857440671848E-2,46.155563038809831,3.3333333333333321]
["03:30:00",1.2749999999999999E-2,8.7530000000000004E-3,8.6440000000000003E-2,6.9015748031735014E-3,7.7613206102018939E-2,47.344055722231552,3.4999999999999987]
["03:40:00",1.2999999999999999E-2,9.0030000000000006E-3,8.6440000000000003E-2,7.130706495394829E-3,7.9444543168296813E-2,48.461171332661053,3.6666666666666652]
["03:50:00",1.325E-2,9.2530000000000008E-3,8.6440000000000003E-2,7.3956077648848727E-3,8.1278814843569094E-2,49.580077054577146,3.8333333333333317]
["04:00:00",1.325E-2,9.2530000000000008E-3,8.6440000000000003E-2,7.6300238426796809E-3,8.2990471430012758E-2,50.624187572307783,3.9999999999999982]
["04:10:00",1.35E-2,9.5029999999999993E-3,8.6440000000000003E-2,7.8498684342116713E-3,8.4601671949574395E-2,51.607019889240377,4.1666666666666652]
["04:20:00",1.375E-2,9.7529999999999995E-3,8.6440000000000003E-2,8.0889406083939457E-3,8.6233077338456865E-2,52.602177176458689,4.3333333333333321]
["04:30:00",1.4E-2,1.0003E-2,8.6440000000000003E-2,8.3130668065472205E-3,8.78825818884858E-2,53.608374951976337,4.4999999999999991]
["04:40:00",1.4250000000000001E-2,1.0253E-2,8.6440000000000003E-2,8.5567061095922943E-3,8.9547939470712268E-2,54.62424307713448,4.6666666666666661]
["04:50:00",1.4500000000000001E-2,1.0503E-2,8.6440000000000003E-2,8.8026801697468366E-3,9.1218405234971711E-2,55.643227193332741,4.833333333333333]
["05:00:00",1.4749999999999999E-2,1.0753E-2,8.6440000000000003E-2,9.0331560149946831E-3,9.2900453012967676E-2,56.669276337910283,5]
["05:10:00",1.4999999999999999E-2,1.1003000000000001E-2,8.6440000000000003E-2,9.2835713538178752E-3,9.4591898569289373E-2,57.701058127266514,5.166666666666667]
["05:20:00",1.525E-2,1.1253000000000001E-2,8.6440000000000003E-2,9.5362588471883895E-3,9.6281818142564979E-2,58.731909066964633,5.3333333333333339]
["05:30:00",1.55E-2,1.1502999999999999E-2,8.6440000000000003E-2,9.7911982447329848E-3,9.7967986785882324E-2,59.760471939388218,5.5000000000000009]
["05:40:00",1.575E-2,1.1753E-2,8.6440000000000003E-2,1.0048369828069274E-2,9.9648199209094332E-2,60.785401517547541,5.6666666666666679]
["05:50:00",1.6E-2,1.2003E-2,8.6440000000000003E-2,1.0289153931673059E-2,0.10132941703217188,61.810944389624844,5.8333333333333348]
["06:00:00",1.6250000000000001E-2,1.2253E-2,8.6440000000000003E-2,1.0550576624613209E-2,0.10300954954547371,62.835825222738961,6.0000000000000018]
["06:10:00",1.6500000000000001E-2,1.2503E-2,8.6440000000000003E-2,1.0814176606694006E-2,0.10467737582515868,63.853199253346794,6.1666666666666687]
["06:20:00",1.7000000000000001E-2,1.3003000000000001E-2,8.6440000000000003E-2,1.1079936040223226E-2,0.10645371386765841,64.936765459271626,6.3333333333333357]
["06:30:00",1.7250000000000001E-2,1.3252999999999999E-2,8.6440000000000003E-2,1.1386283023672448E-2,0.10831754055754578,66.073699740102924,6.5000000000000027]
["06:40:00",1.7749999999999998E-2,1.3753E-2,8.6440000000000003E-2,1.1676001751745588E-2,0.11025707263520904,67.256814307477512,6.6666666666666696]
["06:50:00",1.7999999999999999E-2,1.4003E-2,8.6440000000000003E-2,1.1987697989821678E-2,0.11226967931968414,68.484504385007327,6.8333333333333366]
["07:00:00",1.8499999999999999E-2,1.4503E-2,8.6440000000000003E-2,1.2341612669128098E-2,0.11432378883167606,69.737511187322397,7.0000000000000036]
["07:10:00",1.9E-2,1.5003000000000001E-2,8.6440000000000003E-2,1.2698943278902501E-2,0.11651990885723479,71.07714440291322,7.1666666666666705]
["07:20:00",1.925E-2,1.5252999999999999E-2,8.6440000000000003E-2,1.3059657471078585E-2,0.1187317445539654,72.426364177918899,7.3333333333333375]
["07:30:00",1.975E-2,1.5753E-2,8.6440000000000003E-2,1.342372379955931E-2,0.12095598327332381,73.783149796727528,7.5000000000000044]
["07:40:00",2.0500000000000001E-2,1.6503E-2,8.6440000000000003E-2,1.3832136287999475E-2,0.12341506847616376,75.283191770459894,7.6666666666666714]
["07:50:00",2.1000000000000001E-2,1.7003000000000001E-2,8.6440000000000003E-2,1.4286077713803531E-2,0.12606479929494915,76.899527569918988,7.8333333333333384]
["08:00:00",2.1499999999999998E-2,1.7503000000000001E-2,8.6440000000000003E-2,1.4744879084034636E-2,0.12875744349273366,78.542040530567533,8.0000000000000053]
["08:10:00",2.2249999999999999E-2,1.8252999999999998E-2,8.6440000000000003E-2,1.5229676109963102E-2,0.13160077700388231,80.276473972368208,8.1666666666666714]
["08:20:00",2.2749999999999999E-2,1.8752999999999999E-2,8.6440000000000003E-2,1.5741094195883175E-2,0.13456892275510543,82.08704288061432,8.3333333333333375]
["08:30:00",2.35E-2,1.9503E-2,8.6440000000000003E-2,1.630144771896265E-2,0.13762472181337798,83.951080306160577,8.5000000000000036]
["08:40:00",2.4500000000000001E-2,2.0503E-2,8.6440000000000003E-2,1.6890227619789498E-2,0.14097602902382775,85.995377704534931,8.6666666666666696]
["08:50:00",2.5250000000000002E-2,2.1253000000000001E-2,8.6440000000000003E-2,1.7552543237838388E-2,0.14457269909384682,88.189346447246564,8.8333333333333357]
["09:00:00",2.6249999999999999E-2,2.2252999999999998E-2,8.6440000000000003E-2,1.8223296564499773E-2,0.14837441722384445,90.508394506545116,9.0000000000000018]
["09:10:00",2.725E-2,2.3252999999999999E-2,8.6440000000000003E-2,1.8993551713908676E-2,0.15245104921806982,92.995140023022586,9.1666666666666679]
["09:20:00",2.8500000000000001E-2,2.4503E-2,8.6440000000000003E-2,1.982061918623608E-2,0.15684867008685108,95.677688752979151,9.3333333333333339]
["09:30:00",2.9749999999999999E-2,2.5753000000000002E-2,8.6440000000000003E-2,2.0729770959511108E-2,0.16162192083484425,98.589371709254991,9.5]
["09:40:00",3.125E-2,2.7252999999999999E-2,8.6440000000000003E-2,2.1723939019068397E-2,0.16681157166505106,101.75505871568114,9.6666666666666661]
["09:50:00",3.2750000000000001E-2,2.8753000000000001E-2,8.6440000000000003E-2,2.2830455221817866E-2,0.17244350892363158,105.19054044341526,9.8333333333333321]
["10:00:00",3.4750000000000003E-2,3.0752999999999999E-2,8.6440000000000003E-2,2.4103168736067122E-2,0.17862664468204878,108.96225325604976,9.9999999999999982]
["10:10:00",3.6749999999999998E-2,3.2752999999999997E-2,8.6440000000000003E-2,2.5499279418229361E-2,0.18546445706518166,113.13331880976082,10.166666666666664]
["10:20:00",3.925E-2,3.5253E-2,8.6440000000000003E-2,2.7075235621221449E-2,0.19305371196381244,117.76276429792559,10.33333333333333]
["10:30:00",4.2250000000000003E-2,3.8253000000000002E-2,8.6440000000000003E-2,2.8891998954940597E-2,0.20167933430340487,123.02439392507698,10.499999999999996]
["10:40:00",4.5749999999999999E-2,4.1752999999999998E-2,8.6440000000000003E-2,3.1042763060242735E-2,0.21155043495167539,129.04576532052198,10.666666666666663]
["10:50:00",0.05,4.6003000000000002E-2,8.6440000000000003E-2,3.3574819441489982E-2,0.22292998454098714,135.98729057000216,10.833333333333329]
["11:00:00",5.5500000000000001E-2,5.1503E-2,8.6440000000000003E-2,3.6653930788335884E-2,0.23634502541156457,144.17046550105439,{"$f":"H72+1/6","v":10.999999999999995}]
["11:10:00",6.275E-2,5.8753E-2,8.6440000000000003E-2,3.8095563690619769E-2,0.25380724124158643,154.82241715736771,11.166666666666661]
["11:20:00",7.2499999999999995E-2,6.8502999999999994E-2,8.6440000000000003E-2,3.9120975653961026E-2,0.27841681205572699,169.83425535399346,11.333333333333327]
["11:30:00",8.6999999999999994E-2,8.3002999999999993E-2,8.6440000000000003E-2,4.0607823000805857E-2,0.31371707501239898,191.36741575756338,11.499999999999993]
["11:40:00",0.11125,0.107253,8.6440000000000003E-2,4.3056835339394701E-2,0.3661390463204971,223.34481825550321,11.666666666666659]
["11:50:00",0.16125,0.157253,8.6440000000000003E-2,4.9418195483959815E-2,0.45074444099753586,274.95410900849686,11.833333333333325]
["12:00:00",0.38900000000000001,0.38500299999999998,8.6440000000000003E-2,6.2579756076945298E-2,0.66234675990200864,404.03152354022529,11.999999999999991]
["12:10:00",0.2175,0.213503,8.6440000000000003E-2,7.4144493331335368E-2,0.88945253888154274,542.56604871774107,12.166666666666657]
["12:20:00",0.13075000000000001,0.126753,8.6440000000000003E-2,7.8364080788674378E-2,0.98178733849465272,598.89027648173817,12.333333333333323]
["12:30:00",9.7250000000000003E-2,9.3253000000000003E-2,8.6440000000000003E-2,7.91681348704628E-2,1,610,12.499999999999989]
["12:40:00",7.9000000000000001E-2,7.5003E-2,8.6440000000000003E-2,7.9082185290383411E-2,0.99799384329981133,608.77624441288492,12.666666666666655]
["12:50:00",6.7250000000000004E-2,6.3253000000000004E-2,8.6440000000000003E-2,7.8656432567601284E-2,0.98841222795981887,602.93145905548954,12.833333333333321]
["13:00:00",5.8999999999999997E-2,5.5003000000000003E-2,8.6440000000000003E-2,7.7819788481600649E-2,0.96961539793562124,591.46539274072893,12.999999999999988]
["13:10:00",5.2749999999999998E-2,4.8752999999999998E-2,8.6440000000000003E-2,7.6697455858158098E-2,0.94465085153901862,576.23701943880133,13.166666666666654]
["13:20:00",4.7750000000000001E-2,4.3753E-2,8.6440000000000003E-2,7.5355666718803171E-2,0.91536538141920154,558.37288266571295,13.33333333333332]
["13:30:00",4.3999999999999997E-2,4.0002999999999997E-2,8.6440000000000003E-2,7.3851546736061632E-2,0.88317626004795657,538.73751862925349,13.499999999999986]
["13:40:00",4.0750000000000001E-2,3.6753000000000001E-2,8.6440000000000003E-2,7.2222045494549636E-2,0.84908564091814764,517.94224096007008,13.666666666666652]
["13:50:00",3.7999999999999999E-2,3.4002999999999999E-2,8.6440000000000003E-2,7.0494650773456694E-2,0.81369513455683307,496.35403207966817,13.833333333333318]
["14:00:00",3.5749999999999997E-2,3.1753000000000003E-2,8.6440000000000003E-2,6.8692919838945543E-2,0.77758124737040579,474.32456089594751,13.999999999999984]
["14:10:00",3.3750000000000002E-2,2.9753000000000002E-2,8.6440000000000003E-2,6.6823561667812892E-2,0.74118264990806559,452.12141644392,14.16666666666665]
["14:20:00",3.2000000000000001E-2,2.8003E-2,8.6440000000000003E-2,6.4900381754995767E-2,0.70480497281488097,429.9310334170774,14.333333333333316]
["14:30:00",3.0499999999999999E-2,2.6502999999999999E-2,8.6440000000000003E-2,6.2931954550029992E-2,0.66874284020585184,407.93313252556965,14.499999999999982]
["14:40:00",2.9000000000000001E-2,2.5003000000000001E-2,8.6440000000000003E-2,6.093482369677073E-2,0.63315557221562202,386.22489905152941,14.666666666666648]
["14:50:00",2.8000000000000001E-2,2.4003E-2,8.6440000000000003E-2,5.8906069792107718E-2,0.59831873935223912,364.97443100486589,14.833333333333314]
["15:00:00",2.6749999999999999E-2,2.2752999999999999E-2,8.6440000000000003E-2,5.6864735575147318E-2,0.56437703179457277,344.26998939468939,14.99999999999998]
["15:10:00",2.5749999999999999E-2,2.1753000000000002E-2,8.6440000000000003E-2,5.4809415431956672E-2,0.53134351490583309,324.11954409255821,15.166666666666647]
["15:20:00",2.4750000000000001E-2,2.0753000000000001E-2,8.6440000000000003E-2,5.2738474212256269E-2,0.499355700326712,304.60697719929431,15.333333333333313]
["15:30:00",2.4E-2,2.0003E-2,8.6440000000000003E-2,5.0666776810194984E-2,0.46854459326649012,285.81220189255896,15.499999999999979]
["15:40:00",2.325E-2,1.9252999999999999E-2,8.6440000000000003E-2,4.859422651184693E-2,0.43903393589499412,267.81070089594641,15.666666666666645]
["15:50:00",2.2499999999999999E-2,1.8502999999999999E-2,8.6440000000000003E-2,4.6520709324864594E-2,0.41082462318841467,250.60302014493294,15.833333333333311]
["16:00:00",2.1749999999999999E-2,1.7753000000000001E-2,8.6440000000000003E-2,4.4465212282371235E-2,0.38390826829961011,234.18404366276218,15.999999999999977]
["16:10:00",2.1250000000000002E-2,1.7253000000000001E-2,8.6440000000000003E-2,4.247919983390365E-2,0.35836478693095036,218.60252002787971,16.166666666666643]
["16:20:00",2.0750000000000001E-2,1.6753000000000001E-2,8.6440000000000003E-2,4.1453787870562392E-2,0.33381053068285227,203.62442371653989,16.333333333333311]
["16:30:00",0.02,1.6003E-2,8.6440000000000003E-2,4.043863002685455E-2,0.30964507925789309,188.8834983473148,16.499999999999979]
["16:40:00",1.95E-2,1.5502999999999999E-2,8.6440000000000003E-2,3.9433726302780116E-2,0.2858583466367613,174.37359144842441,16.666666666666647]
["16:50:00",1.925E-2,1.5252999999999999E-2,8.6440000000000003E-2,3.8464711997422622E-2,0.26267354091535017,160.2308599583636,16.833333333333314]
["17:00:00",1.8749999999999999E-2,1.4753E-2,8.6440000000000003E-2,3.750919953999645E-2,0.2400663713067834,146.44048649713787,16.999999999999982]
["17:10:00",1.8249999999999999E-2,1.4253E-2,8.6440000000000003E-2,3.2860281812289456E-2,0.21972367555975755,134.03144209145211,17.16666666666665]
["17:20:00",1.7749999999999998E-2,1.3753E-2,8.6440000000000003E-2,2.9181048998732369E-2,0.20298498827564845,123.82084284814556,17.333333333333318]
["17:30:00",1.7500000000000002E-2,1.3502999999999999E-2,8.6440000000000003E-2,2.6257905031655187E-2,0.18912451908037589,115.36595663902929,17.499999999999986]
["17:40:00",1.7000000000000001E-2,1.3003000000000001E-2,8.6440000000000003E-2,2.3856632240418792E-2,0.17751376304492966,108.2833954574071,17.666666666666654]
["17:50:00",1.6750000000000001E-2,1.2753E-2,8.6440000000000003E-2,2.1915058035350182E-2,0.16766998094209246,102.27868837467641,17.833333333333321]
["18:00:00",1.6500000000000001E-2,1.2503E-2,8.6440000000000003E-2,2.0308474005733775E-2,0.15932529305303478,97.188428762351222,17.999999999999989]
["18:10:00",1.6250000000000001E-2,1.2253E-2,8.6440000000000003E-2,1.8947948960874306E-2,0.15219393749568655,92.838301872368802,18.166666666666657]
["18:20:00",1.575E-2,1.1753E-2,8.6440000000000003E-2,1.779751204296634E-2,0.14592862880527313,89.016463571216605,18.333333333333325]
["18:30:00",1.55E-2,1.1502999999999999E-2,8.6440000000000003E-2,1.6780669600681947E-2,0.14036034275101986,85.619809078122117,18.499999999999993]
["18:40:00",1.525E-2,1.1253000000000001E-2,8.6440000000000003E-2,1.5912814282489651E-2,0.13547305559536171,82.638563913170643,18.666666666666661]
["18:50:00",1.4999999999999999E-2,1.1003000000000001E-2,8.6440000000000003E-2,1.514498850525213E-2,0.13114430012598052,79.998023076848114,18.833333333333329]
["19:00:00",1.4749999999999999E-2,1.0753E-2,8.6440000000000003E-2,1.4473184701414295E-2,0.12727765756532489,77.639371114848188,18.999999999999996]
["19:10:00",1.4500000000000001E-2,1.0503E-2,8.6440000000000003E-2,1.3893749310763035E-2,0.12378047690359834,75.506090911194988,19.166666666666664]
["19:20:00",1.4250000000000001E-2,1.0253E-2,8.6440000000000003E-2,1.3362814599267211E-2,0.12058347825932117,73.555921738185916,19.333333333333332]
["19:30:00",1.4E-2,1.0003E-2,8.6440000000000003E-2,1.2878879413215888E-2,0.11763969431875571,71.760213534440979,19.5]
["19:40:00",1.375E-2,9.7529999999999995E-3,8.6440000000000003E-2,1.2440529923558248E-2,0.11490359136624383,70.091190733408737,19.666666666666668]
["19:50:00",1.375E-2,9.7529999999999995E-3,8.6440000000000003E-2,1.2046445151403015E-2,0.11245393149331206,68.596898210920358,19.833333333333336]
["20:00:00",1.35E-2,9.5029999999999993E-3,8.6440000000000003E-2,1.1676001751745588E-2,0.11025731826225538,67.256964139975778,20.000000000000004]
["20:10:00",1.325E-2,9.2530000000000008E-3,8.6440000000000003E-2,1.1347837518876379E-2,0.10815838091604785,65.976612358789183,20.166666666666671]
["20:20:00",1.2999999999999999E-2,9.0030000000000006E-3,8.6440000000000003E-2,1.104183885982685E-2,0.10612542531996429,64.736509445178214,20.333333333333339]
["20:30:00",1.2999999999999999E-2,9.0030000000000006E-3,8.6440000000000003E-2,1.0738641202072841E-2,0.10426912365017754,63.604165426608304,20.500000000000007]
["20:40:00",1.2749999999999999E-2,8.7530000000000004E-3,8.6440000000000003E-2,1.047566146312273E-2,0.10256831906073711,62.566674627049636,20.666666666666675]
["20:50:00",1.2500000000000001E-2,8.5030000000000001E-3,8.6440000000000003E-2,1.021486419153657E-2,0.10087920808303581,61.536316930651843,20.833333333333343]
["21:00:00",1.2500000000000001E-2,8.5030000000000001E-3,8.6440000000000003E-2,9.9930746881623216E-3,9.9304484043839639E-2,60.575735266742178,21.000000000000011]
["21:10:00",1.225E-2,8.2529999999999999E-3,8.6440000000000003E-2,9.772914030610657E-3,9.7824161723131617E-2,59.672738651110286,21.166666666666679]
["21:20:00",1.2E-2,8.0029999999999997E-3,8.6440000000000003E-2,9.5362588471883895E-3,9.6322601291427168E-2,58.756786787770572,21.333333333333346]
["21:30:00",1.2E-2,8.0029999999999997E-3,8.6440000000000003E-2,9.3375280938217328E-3,9.4912214271258261E-2,57.896450705467537,21.500000000000014]
["21:40:00",1.175E-2,7.7530000000000003E-3,8.6440000000000003E-2,9.1223279346551757E-3,9.3582449011351571E-2,57.085293896924462,{"$f":"H136+1/6","v":21.666666666666682}]
["21:50:00",1.175E-2,7.7530000000000003E-3,8.6440000000000003E-2,8.9442765594863489E-3,9.2323135325708211E-2,56.317112548682005,21.83333333333335]
["22:00:00",1.15E-2,7.5030000000000001E-3,8.6440000000000003E-2,8.7673989127931683E-3,9.1115426077046147E-2,55.580409906998149,22.000000000000018]
["22:10:00",1.15E-2,7.5030000000000001E-3,8.6440000000000003E-2,8.6092190459139857E-3,8.9949548392436074E-2,54.869224519386002,22.166666666666686]
["22:20:00",1.125E-2,7.2529999999999999E-3,8.6440000000000003E-2,8.4520020744354319E-3,8.8815833087346183E-2,54.177658183281174,22.333333333333353]
["22:30:00",1.125E-2,7.2529999999999999E-3,8.6440000000000003E-2,8.2784530933470903E-3,8.7721838742535099E-2,53.510321632946415,22.500000000000021]
["22:40:00",1.0999999999999999E-2,7.0029999999999997E-3,8.6440000000000003E-2,8.1404806643783773E-3,8.6658100828899631E-2,52.861441505628775,22.666666666666689]
["22:50:00",1.0999999999999999E-2,7.0029999999999997E-3,8.6440000000000003E-2,8.0032833716376442E-3,8.5606741466924541E-2,52.22011229482397,22.833333333333357]
["23:00:00",1.0749999999999999E-2,6.7530000000000003E-3,8.6440000000000003E-2,7.8498684342116713E-3,8.4575355332900282E-2,51.590966753069175,23.000000000000025]
["23:10:00",1.0749999999999999E-2,6.7530000000000003E-3,8.6440000000000003E-2,7.6974464911169892E-3,8.3571429959787835E-2,50.978572275470576,23.166666666666693]
["23:20:00",1.0500000000000001E-2,6.5030000000000001E-3,8.6440000000000003E-2,7.5627992056699787E-3,8.2585735354810633E-2,50.377298566434483,23.333333333333361]
["23:30:00",1.0500000000000001E-2,6.5030000000000001E-3,8.6440000000000003E-2,7.4289463110433565E-3,8.1609139199049982E-2,49.781574911420485,23.500000000000028]
["23:40:00",1.025E-2,6.2529999999999999E-3,8.6440000000000003E-2,7.29589255007958E-3,8.0640857791940329E-2,49.190923253083604,23.666666666666696]
["23:50:00",1.025E-2,6.2529999999999999E-3,8.6440000000000003E-2,7.1636427516005652E-3,7.9680102725540269E-2,48.604862662579563,23.833333333333364]
[1,1.025E-2,6.2529999999999999E-3,8.6440000000000003E-2,7.0649859578558478E-3,7.8832908278266625E-2,48.088074049742637,24.000000000000032]